��������ID,�������ʎ��,���ǂ̗L��,���ҍu�����ǂ���,�O�����ǂ���,DOI,PubMedID,PubMedCID,ISSN,J-GLOBAL ID,ISBN,NAID:CiNii Books or Articles��ID,�Y�ƍ��Y�� �������,�Y�ƍ��Y�� �o��ԍ�,�Y�ƍ��Y�� ���J�ԍ�,URL,���Җ��E���\�Җ�,�^�C�g��,�^�C�g���i�p��j,�w�,�o�Ŏ�,��,��,�J�n�y�[�W,�I���y�[�W,�N,�N����,�Y�ƍ��Y�� ������,�Y�ƍ��Y�� ������/�o��l,�Y�ƍ��Y�� �o��N,�Y�ƍ��Y�� �o��N����,�Y�ƍ��Y�� �擾�N,�Y�ƍ��Y�� �擾�N����,�Y�ƍ��Y�� ���J�N,�Y�ƍ��Y�� ���J�N����,�����e�L�X�g
10363657,�G���_��,no,no,no,,,,"",,"",40007307562,,,,,���F��,������Ƃɂ�����C���^�[�l�b�g�����p��������ҎQ���^���i�J��:�����̎���𒆐S�Ƃ���,,,,,,81,88,2006,2006,,,,,,,,,
10363658,�}��,no,no,no,,,,"",,"",,,,,,���F��,IT�}�[�P�e�B���O�헪:����҂Ƃ̊֌W���\�z��ڎw����,,,�n����,,,,,2005,2005,,,,,,,,,
13441821,�G���_��,no,no,no,,,,"",,"",,,,,,"Osaki, T.",How Can Japanese Consumer Electronics Manufacturers Survive against Severe Global Competition?,,,,"vol.7, no.1",,85,90,2013,2013,,,,,,,,,
13441822,�G���_��,no,no,no,,,,"",,"",,,,,,���F��,���B�̔��^�e���r�s��,,,,13���A1��,,47,56,2012,2012,,,,,,,,,
13441823,�G���_��,no,no,no,,,,"",,"",,,,,,���F��,���^�e���r�̍��ۃ}�[�P�e�B���O�헪,,,,12���A2.3������,,27,33,2011,2011,,,,,,,,,
13441824,�G���_��,no,no,no,,,,"",,"",,,,,,"Osaki,T.",Global Marketing Strategies for Japanese Consumer Electronics Manufacturers,,,,"vol.5, no.8 (B)",,2731,2734,2011,2011,,,,,,,,,
13441825,�G���_��,no,no,no,,,,"",,"",,,,,,���F��,�G���N�g���j�N�X���[�J�[�̍��ێs��헪,,,,11���A4��,,29,42,2011,2011,,,,,,,,,
13441826,�w��\,no,no,no,,,,"",,"",,,,,,"Osaki, T.",How Can Japanese Consumer Electronics Manufacturers Survive against Severe Global Competition?,,ICICIC 2012,,,,,,2012,2012/11/5,,,,,,,,,
13441827,�w��\,no,no,no,,,,"",,"",,,,,,"Osaki, T.",Global Marketing Strategies for Japanese Consumer Electronics Manufacturers,,2011 ISII,,,,,,2011,2011/5/2,,,,,,,,,
13441830,�G���_��,yes,no,no,,,,"",,"",,,,,,OSAKI Takanori,Global Marketing Strategies for Japanese Consumer Electronics Manufacturers,,,,5,,2731,2734,2011,2011,,,,,,,,,
13441832,�w��\,no,no,no,,,,"",,"",,,,,,���F��,Global Marketing strategies for Japanese Consumer Electronics Manufacturers,,2011 International Symposium on Intelligent Informatics,,,,,,2011,2011/5/2,,,,,,,,,
13441834,�G���_��,yes,no,no,,,,"",,"",,,,,,Takanori Osaki,How Can Japanese Consumer Electronics Manufacturers Survive against Severe Global Competition?,,,,"Vol.7, No.1",,85,90,2013,2013,,,,,,,,,
13441835,�w��\,no,no,no,,,,"",,"",,,,,,Takanori Osaki,How Can Japanese Consumer Electronics Manufacturers Survive against Severe Global Competition?,,ICICIC2012,,,,,,,,,,,,,,,,
15034671,�G���_��,yes,no,no,,,,"",,"",,,,,,Takanori Osaki,Premium Product Marketing: The Case of Lexus in Japan,,,,no.39.,,1,7,2013,2013,,,,,,,,,
15034672,�G���_��,yes,no,no,,,,"",,"",,,,,,Takanori Osaki,The Marketing Strategy for High Value-added Products in Japan: Application of Customization,,,,"vol.8, no.1.",,181,185,2014,2014,,,,,,,,,
15034673,�G���_��,no,no,no,,,,"",,"",,,,,,���F��,���t�����lPB�̃}�[�P�e�B���O: �o���[�̎���𒆐S�Ƃ���,,,,��14���@��4��,,1,12,2014,2014,,,,,,,,,
15034674,�w��\,no,no,no,,,,"",,"",,,,,,Takanori�@Osaki,Premium Product Marketing: The Case of Lexus in Japan,,Academy�@of Marketing Conference,,,,,,2013,2013,,,,,,,,,
15034675,�w��\,no,no,no,,,,"",,"",,,,,,Takanori�@Osaki,The Marketing Strategy for High Value-added Products in Japan: Application of Customization,,ICICIC2013,,,,,,2013,2013,,,,,,,,,
15034676,�G���_��,yes,no,no,,,,"",,"",,,,,,"Takanori Osaki, Hiroshi Torii",What is the Identity of the Enjoyment in Customization?,,,,-,,1,9,2014,2014,,,,,,,,,
15034677,�G���_��,yes,no,no,,,,"",,"",,,,,,"Takanori Osaki, Hiroshi Torii",Consumers�f Intention toward Customization: What Do Consumers Want from Customization over the Costs?,,,,-,,196,202,2014,2014,,,,,,,,,
15034682,�w��\,no,no,no,,,,"",,"",,,,,,"Takanori Osaki, Hiroshi Torii",What is the Identity of the Enjoyment in Customization?,,2014 Academy�@of Marketing Conference,,,,,,,"",,,,,,,,,
15034683,�w��\,no,no,no,,,,"",,"",,,,,,"Takanori Osaki, Hiroshi Torii",Consumers�f Intention toward Customization:�@What Do Consumers Want from Customization over the Costs?,,ANZMAC2014,,,,,,,"",,,,,,,,,
20518780,�G���_��,yes,no,no,,,,"",,"",,,,,,"Rika Ito, Takanori Osaki",A Study of Consumer and Customization from the Point of View of an Experience,,,,10(2),,181,185,2015,2015,,,,,,,,,
