��������ID,�������ʎ��,���ǂ̗L��,���ҍu�����ǂ���,�O�����ǂ���,DOI,PubMedID,PubMedCID,ISSN,J-GLOBAL ID,ISBN,NAID:CiNii Books or Articles��ID,�Y�ƍ��Y�� �������,�Y�ƍ��Y�� �o��ԍ�,�Y�ƍ��Y�� ���J�ԍ�,URL,���Җ��E���\�Җ�,�^�C�g��,�^�C�g���i�p��j,�w�,�o�Ŏ�,��,��,�J�n�y�[�W,�I���y�[�W,�N,�N����,�Y�ƍ��Y�� ������,�Y�ƍ��Y�� ������/�o��l,�Y�ƍ��Y�� �o��N,�Y�ƍ��Y�� �o��N����,�Y�ƍ��Y�� �擾�N,�Y�ƍ��Y�� �擾�N����,�Y�ƍ��Y�� ���J�N,�Y�ƍ��Y�� ���J�N����,�����e�L�X�g
11522076,�G���_��,yes,no,no,,,,"",,"",,,,,,"Jian G, Masaki T, 18 others (last)",Use of protein array to investigate receptor tyrosine kinases activated in gastric cancer.,,,,,,,,,,,,,,,,,,
11522077,�G���_��,yes,no,no,,,,"",,"",,,,,,"Izuishi K, Masaki T, Suzuki Y",High concentration of lactic dehydrogenase in small volumes of ascites,,,,,,105,6,2010,2010,,,,,,,,,
11522078,�G���_��,yes,no,no,,,,"",,"",,,,,,"Deguchi K, Masaki T, 7others (last)",The close relationship between life-threatening breathing disorders and urine storage dysfunction in multiple system atrophy.,,,,,,1,6,2010,2010,,,,,,,,,
11522079,�G���_��,yes,no,no,,,,"",,"",,,,,,"Sano T, Izuishi K, Takebayashi R, Masaki T, Suzuki Y",Operative management of solitary intra-abdominal recurrence of hepatocellular carcinoma,,,,,,311,311,2010,2010,,,,,,,,,
11522080,�G���_��,yes,no,no,,,,"",,"",130000122050,,,,,"Himoto T, Masaki T, 13 others (11)nd",Cytomegalovirus-associated Acute Gastric Mucosal Lesion in an Immunocompetent Host,,,,,,1521,1524,2009,2009,,,,,,,,,
11522081,�G���_��,yes,no,no,,,,"",,"",10025327002,,,,,Masaki T,MicroRNA and hepatocellular carcinoma,,,,,,751,2,2009,2009,,,,,,,,,
11522082,�G���_��,yes,no,no,,,,"",,"",,,,,,"Sano T, Izuishi K, Takebayashi R, Kushida Y, Masaki T, Suzuki Y",Education and imaging. Hepatobiliary and pancreatic:Isolated diaphragmatic metastasis from hepatocellular carcinoma,,,,,,1475,1475,2009,2009,,,,,,,,,
11522083,�G���_��,yes,no,no,,,,"",,"",,,,,,"Urai Y, Masaki T, 12 others (last)",Paraneoplastic necrotizing myelopathy in a patient with advanced esophageal cancer: An autopsied case report,,,,,,113,7,2009,2009,,,,,,,,,
11522084,�G���_��,yes,no,no,,,,"",,"",,,,,,"Yurimoto S, Masaki T, 6 others (6)nd","Tokumitsu H, Identification and Characterization of Wolframin",,,,,,3946,3955,2009,2009,,,,,,,,,
11522085,�G���_��,yes,no,no,,,,"",,"",,,,,,"Yoshida S, Kurokohchi K, Ueno T, Yoshino M, Shimada M, Masaki T",Hepatic von Meyenburg complex:a triggre of severe portal hypertension,,,,,,614,615,2009,2009,,,,,,,,,
11522086,�G���_��,yes,no,no,,,,"",,"",,,,,,"Kinekawa F, Masaki T, 10 others (2nd)",Authors' reply,,,,,,237,237,2009,2009,,,,,,,,,
11522087,�G���_��,yes,no,no,,,,"",,"",,,,,,"Hashimoto N, Masaki T, 20others (7)nd",Immunohistochemically detected expression of p27(Kip1) and Skp2 predicts survival in patients with intrahepatic cholangiocarcinomas,,,,,,395,403,2009,2009,,,,,,,,,
11522088,�G���_��,yes,no,no,,,,"",,"",,,,,,"Himoto T, Masaki T, Deguchi A, 9others (5, 7)thnd",Clinical characteristics of patients with hepatitis C virus-related chronic liver disease seropositive for anticentromere antibody,,,,,,360,8,2009,2009,,,,,,,,,
11522089,�G���_��,yes,no,no,,,,"",,"",,,,,,"Fujiwara M, Izuishi K, Sano T, Hossain MA, Kimura S, Masaki T, Suzuki Y",Modulating effect of the PI3-kinase inhibitor LY294002 on cisplatin in human pancreatic cancer cells,,,,,,76,76,2008,2008,,,,,,,,,
11522090,�G���_��,yes,no,no,,,,"",,"",,,,,,"Mohammad SH, Yoneyama H, Deguchi A, Himoto T, Masaki T, 20 others (12th, last author)",Annexin A2 expression and phosphorylation are up-regulated in hepatocellular carcinoma,,,,,,1157,1163,2008,2008,,,,,,,,,
11522091,�G���_��,yes,no,no,,,,"",,"",,,,,,"Uchida N, Masaki T, 5 others (4th)",How many cytological examinations should be performed for the diagnosis of malignant biliary stricture via an endoscopic nasobiliary drainage tube?,,,,,,1501,4,2008,2008,,,,,,,,,
11522092,�G���_��,yes,no,no,,,,"",,"",10021268554,,,,,"Kinekawa F, Masaki T, 10 others (last author)",Esophageal function worsens with long duration of diabetes,,,,,,338,344,2008,2008,,,,,,,,,
11522094,�G���_��,yes,no,no,,,,"",,"",,,,,,"Kurokohchi K, Yoneyama H, Deguchi A, Masaki T, Himoto T, 6 others (4, 5)ththh",A combination therapy of ethanol injection and radiofrequency ablation under general anesthesia for the treatment of hepatocellular carcinoma,,,,,,2037,2043,2008,2008,,,,,,,,,
11522095,�G���_��,yes,no,no,,,,"",,"",,,,,,"Kurokohchi K, Deguchi A, Masaki T, Yoneyama H, Himoto T, 4 others",ndrd Comparative study of the effects of percutaneous ethanol injection and radiofrequency ablation in cases treated with a straight or expandable electrode,,,,,,1275,1279,2007,2007,,,,,,,,,
11522096,�G���_��,yes,no,no,,,,"",,"",,,,,,"Yasokawa T, Ishimaru I, Kuriyama S, Masaki T, Takegawa K, Tanaka N",A double filtering method for measuring the translational velocity of fluorescently stained cells,,,,,,,,2007,2007,,,,,,,,,
11522097,�G���_��,yes,no,no,,,,"",,"",,,,,,"Himoto T, Deguchi A, Masaki T, 9 others (4, 8)",thth Efficacy of zinc administration in patients with hepatitis C virus-related chronic liver disease,,,,,,1078,1087,2007,2007,,,,,,,,,
11522098,�G���_��,yes,no,no,,,,"",,"",,,,,,"Kurokohchi K, Deguchi A, Masaki T, Himoto T, Yoneyama H, 7 orhers (2, 3)",ndrd Successful treatment of hypovascular advanced hepatocellular carcinoma with lipiodol-targetting intervention radiology,,,,,,4398,4400,2007,2007,,,,,,,,,
11522099,�G���_��,yes,no,no,,,,"",,"",,,,,,"Ogawa M, Deguchi A, Masaki T, 5 others (3, 5)","rdthVitamins K2, K3 and K5 exert antitumor effects on established colorectal cancer in mice by inducing apoptotic death of tumor cells",,,,,,323,331,2007,2007,,,,,,,,,
11522100,�G���_��,yes,no,no,,,,"",,"",10019817199,,,,,"Uchida N, Masaki T, 8 Others (6nd)",Utility of pancreatic duct brushing for diagnosis of pancreatic carcinoma,,,,,,657,662,2007,2007,,,,,,,,,
11522101,�G���_��,yes,no,no,,,,"",,"",,,,,,"Tsutsui K, Masaki T, 11 Others (11th)",Usefulness of single and repetitive percutaneous transhepatic gallbladder aspiration for the treatment of acute cholecystitis.,,,,,,583,588,2007,2007,,,,,,,,,
11522102,�G���_��,yes,no,no,,,,"",,"",10019859909,,,,,"Yasokawa T, Masaki T, 5 others (5th)",A method for measuring the three-dimensional refractive-index distribution of single cells using proximal two-beam optical tweezers and a phase-shifting mach-zehnder interferometer,,,,,,161,164,2007,2007,,,,,,,,,
11522103,�G���_��,yes,no,no,,,,"",,"",,,,,,"Iwama H, Masaki T, Kuriyama S.",Abundance of microRNA target motifs in the 3'-UTRs of 20527human genes,,,,,,1805,10,2007,2007,,,,,,,,,
11522104,�G���_��,yes,no,no,,,,"",,"",,,,,,"Yasokawa T, Masaki T, 6 others (6th)",Technique for measuring the rotational velocity of a single cell.,,,,,,,,2007,2007,,,,,,,,,
11522105,�G���_��,yes,no,no,,,,"",,"",,,,,,"Kuriyama S, Deguchi A, Masaki T, 12 others (8, 13)",thth Sequential assessment of the intrahepatic expression of epidermal growth factor and transforming growth factor-beta1 in hepatofibrogenesis of a rat cirrhosis model,,,,,,317,324,2007,2007,,,,,,,,,
11522106,�G���_��,yes,no,no,,,,"",,"",,,,,,"Yamamoto K, Masaki T, 6 others (6th)",,,,,,,,,2007,2007,,,,,,,,,
11522107,�G���_��,yes,no,no,,,,"",,"",,,,,,"Nonomura T, Masaki T, Himoto T, 9 others (2nd)",Identification of c-Yes expression in the nuclei of hepatocellular carcinoma cells: Involvement in the early stages of hepatocarcinogenesis,,,,,,105,111,2006,2006,,,,,,,,,
11522108,�G���_��,yes,no,no,,,,"",,"",,,,,,"Yoshida M, Masaki T, 7others (6th)",Displacement measurement of the depth migration of transparent cells,,,,,,,,2006,2006,,,,,,,,,
11522109,�G���_��,yes,no,no,,,,"",,"",,,,,,"Kobayashi H, Masaki T, 7others (6th)",Three-dimensional phase-contrast imaging of single floating cells,,,,,,,,2006,2006,,,,,,,,,
11522110,�G���_��,yes,no,no,,,,"",,"",,,,,,"Yamamoto K, Masaki T, 9 others (11th)",Imaging technology of three dimensional distribution for sugar chain on single living cell-membrane,,,,,,,,2006,2006,,,,,,,,,
11522111,�G���_��,yes,no,no,,,,"",,"",,,,,,"Kurokohchi K, Masaki T, Yoneyama H, 9 others (9)th",Successful treatment of large-size advanced hepatocellular carcinoma by transarterial chemoembolization followed by the combination therapy of percutaneous ethanol-lipiodol injection and radiofrequency ablation,,,,,,1067,1070,2006,2006,,,,,,,,,
11522112,�G���_��,yes,no,no,,,,"",,"",,,,,,"Masaki T, Morishita A, Kurokohchi K, Kuriyama S",Multidisciplinary treatment of patients with hepatocellular carcinoma,,,,,,1377,1384,2006,2006,,,,,,,,,
11522113,�G���_��,yes,no,no,,,,"",,"",,,,,,"Yasokawa T, Masaki T, 7 others (5th)",Attitudinal manipulation of an optically trapped bacillary probe by controlling the distance between focal points for local dosing in cells.,,,,,,,,2006,2006,,,,,,,,,
11522114,�G���_��,yes,no,no,,,,"",,"",,,,,,"Inoue Y, Masaki T, 7 others (5th)",Variable phase-contrast fluorescence spectrometry for fluorescently stained cells,,,,,,,,2006,2006,,,,,,,,,
11522115,�G���_��,yes,no,no,,,,"",,"",,,,,,"Feng H, Masaki T, Deguchi A, 14 others (2nd, 7th)",Activation of c-Yes in hepatocellular carcinoma: A preliminary study,,,,,,5743,5745,2006,2006,,,,,,,,,
11522116,�G���_��,yes,no,no,,,,"",,"",,,,,,"Ichikawa E, Masaki T, 5 others (5th)",Further resolution of alpha-fetoprotein glycoforms by two-dimensional isoelectric focusing and lectin affinity electrophoresis,,,,,,3480,3487,2006,2006,,,,,,,,,
11522118,�G���_��,yes,no,no,,,,"",,"",,,,,,"Iwama H, Masaki T, Kuriyama S",Abundance of microRNA target motifs in the 3'-UTRs of 20527 humangenes.,,,,,,1805,1810,2007,2007,,,,,,,,,
11522119,�G���_��,yes,no,no,,,,"",,"",,,,,,"Mohammad SH, Deguchi A, Masaki T",Annexin A2 expression and phosphorylation are up-regulated in hepatocellular carcinoma,,,,,,1157,1163,2008,2008,,,,,,,,,
11685747,�G���_��,yes,no,no,,,,"",,"",,,,,,"Yoshida S,Kurokohchi K,Ueno T,Yoshino M,Shimada M,Masaki T",Hepatic Von Meyenburg complex : A trigger of severe portal hypertention,,,,,,614,6145,2009,2009,,,,,,,,,
11685748,�G���_��,yes,no,no,,,,"",,"",,,,,,"Mohammad HS, Kurokohchi K, Iwama H, Masaki T, and 21 others (last author)",Annexin A2 expression and phosphorylation are up-regulated in hepatocellular carcinoma,,,,,,1157,1163,2008,2008,,,,,,,,,
11685749,�G���_��,yes,no,no,,,,"",,"",,,,,,"Kurokohchi K, Masaki T, and 9 others (5^<th>)",A combination therapy of ethanol injection and radiofrequency ablation under general anesthesia for the treatment of hepatocellular carcinoma,,,,,,2037,2043,2008,2008,,,,,,,,,
11685750,�G���_��,yes,no,no,,,,"",,"",,,,,,"Kurokohchi K, Deguchi A, Masaki T, and 9 orhers (2^<nd>)",Successful treatment of hypovascular advanced hepatocellular carcinoma with lipiodol-targetting intervention radiology,,,,,,4398,4400,2007,2007,,,,,,,,,
11685751,�G���_��,yes,no,no,,,,"",,"",,,,,,"Ogawa M, Masaki T, and 6 others (5^<th>)","Vitamins K2, K3 and K5 exert antitumor effects on established colorectal cancer in mice by inducing apoptotic death of tumor cells",,,,,,323,331,2007,2007,,,,,,,,,
11685752,�G���_��,yes,no,no,,,,"",,"",,,,,,"Iwama H, Masaki T, Kuriyama S",Abundance of microRNA target motifs in the 3'-UTRs of 20 527 human genes,,,,,,1805,1810,2007,2007,,,,,,,,,
11685753,�G���_��,yes,no,no,,,,"",,"",,,,,,"Nonomura T, Masaki T, Iwama H, Kurokohchi K,and 8 others (2^<nd>)",Identification of c-Yes expression in the nuclei of hepatocellular carcinoma cells : Involvement in the early stages of hepatocarcinogenesis,,,,,,105,111,2007,2007,,,,,,,,,
11685754,�G���_��,yes,no,no,,,,"",,"",,,,,,"Kurokohchi K, Masaki T, and 7 others (3^<rd>)",Comparative study of the effects of percutaneous ethanol injection and radiofrequency ablation in cases treated with a straight or expandable electrode,,,,,,1275,1279,2007,2007,,,,,,,,,
11685755,�w��\,no,no,no,,,,"",,"",,,,,,�J���A��ԋv�a�A���ؕ�,���[�N�V���b�v13�u�����펾���̕��q��`�w�I�a�ԁv�̊��ɂē��ٓI�Ɍ��シ��microRNA-527 �̋@�\���,,��50����{������a�w����,,,,,,2008,2008/10/3,,,,,,,,,
11685756,�G���_��,yes,no,no,,,,"",,"",,,,,,"Iwama H, Masaki T, Kuriyama S",Abundance of microRNA target motifs in 3^'-UTRs of20527human genes,,,,,,1805,1810,2007,2007,,,,,,,,,
11685757,�G���_��,yes,no,no,,,,"",,"",,,,,,"Kurokohchi K, Masaki T, Kuriyama S",A combination therapy of ethanol injection and radiofrequency ablation under general anesthesia for the treatment of hepatocellular carcinoma,,,,,,2037,2043,2008,2008,,,,,,,,,
11685758,�G���_��,yes,no,no,,,,"",,"",,,,,,"Mohammad SH, Kurokohchi K, Masaki T",Annexin A2 expression and phosphorylation are up-regulated in hepatocellular carcinoma,,,,,,1157,1163,2008,2008,,,,,,,,,
13538723,�G���_��,yes,no,no,10.3892/ijo.2012.1722,,,"",,"",,,,,,"Kobayashi M, Kato K, Iwama H, Fujihara S, Nishiyama N, Mimura S, Toyota Y, Nomura T, Nomura K, Tani J, Miyoshi Hi, Kobara H, Mori H, Murao K, Masaki T",Antitumor effect of metformin in esophageal cancer: In vitro study,,,,42(2),2,517,24,2013,2013,,,,,,,,,
13538724,�G���_��,yes,no,no,10.1093/molbev/mss262,,,"",,"",,,,,,"Iwama H, Kato K, Imachi H, Murao K, Masaki T",Human microRNAs originated from two periods at accelerated rates in mammalian evolution,,,,30(3),3,613,26,2013,2013,,,,,,,,,
13538725,�G���_��,no,no,no,10.1158/1535-7163.mct-11-0594,,,"",,"",,,,,,"Kato K, Gong J, Iwama H, Kitanaka A, Tani J, Miyoshi H, Nomura K, Mimura S, Kobayashi M, Aritomo Y, Kobara H, Mori H, Himoto T, Okano K, Suzuki Y, Murao K, Masaki T",The antidiabetic drug metformin inhibits gastric cancer cell proliferation in vitro and in vivo,,,,11(3),3,549,60,2012,2012,,,,,,,,,
13538727,�G���_��,yes,no,no,,,,"",,"",,,,,,"Liu S, Masaki T (Last)",Use of protein array technology to investigate receptor tyrosine kinases activated in hepatocellular carcinoma,,,,2,,399,403,2011,2011,,,,,,,,,
13538728,�G���_��,yes,no,no,,,,"",,"",,,,,,"Sano T, Masaki T, 8th",Hepatic preconditioning using lipopolysaccharide : Association with specific negative regulators of the toll-like receptor 4 signaling pathway,,,,91,,1082,1089,2011,2011,,,,,,,,,
13835484,�G���_��,yes,no,no,10.1186/cc13147,,,"",,"",,,,,,"Kadowaki T, Morishita A, Niki T, Hara J, Sato M, Tani J, Miyoshi H, Yoneyama H, Masaki T, Hattori T, Matsukawa A, Hirashima M.",Galectin-9 prolongs the survival of septic mice by expanding Tim-3-expressing natural killer T cells and PDCA-1+ CD11c+ macrophages,,,,17(6),6,R284,R284,2013,2013,,,,,,,,,
14281673,�w��\,no,no,no,,,,"",,"",,,,,,��{���u�C�J�@���C�O�D�v���C�ĎR�O�l�C�o���͍L�C���؁@��,C�^�����̎������҂ɂ�����CD36���q��W�I�Ƃ����C���X������R���̉�,,��S�W����{�̑��w���,,,,,,2012,2012,,,,,,,,,
14281674,�w��\,no,no,no,,,,"",,"",,,,,,"Takashi Himoto,Joji Tani, Hisaaki Miyoshi, Michio Inukai,Hisashi Masugata, Fuminori Goda, Reiji Haba, Shoichi Senda, Tsutomu Masaki",��T��O���A�a�ƃ��^�{���b�N�V���h���[���Ɋւ��鍑�ۉ�c,,Contribution of oxidized LDL and CD36 to insulin resistance in patients with HCV-related chronic liver disease.,,,,,,2013,2013,,,,,,,,,
14281675,�w��\,no,no,no,,,,"",,"",,,,,,��{���u�C�J�@���C�O�D�v���C�ĎR�O�l�C�o���͍L�C���؁@��,oxidized LDL�����CD36��W�I�Ƃ���C�^�����̎������҂ɂ�����C���X������R���̉�,,��S�X����{�̑��w���,,,,,,2013,2013,,,,,,,,,
15074656,�G���_��,yes,no,no,10.3892/ijo.2015.2941,,,"",,"",,,,,,"Fujita K, Iwama H, Sakamoto T, Okura R, Kobayashi K, Takano J, Katsura A, Tatsuta M, Maeda E, Mimura S, Nomura T, Tani J, Miyoshi H, Morishita A, Yoneyama H, Yamana Y, Himoto T, Okano K, Suzuki Y, Niki T, Hirashima M, Masaki T.",Galectin-9 suppresses the growth of hepatocellular carcinoma via apoptosis in vitro and in vivo.,,,,46,6,2419,2430,2015,2015,,,,,,,,,
17782053,�G���_��,no,no,no,,,,"",,"",,,,,,"Jin Y, Masaki T, Yoshida S, 8 others (11^<th>)",Identification of p46 Shc expressed in the nuclei of hepatocytes with high proliferating activity : Study of regenerating rat liver.,,,,,,721,728,2004,2004,,,,,,,,,
17782054,�G���_��,no,no,no,,,,"",,"",,,,,,"Kurokohchi K, Masaki T, 10 Others (12^<th>)",Percutaneous ethanol and lipiodol injection therapy for hepatocellular carcinoma.,,,,,,381,387,2004,2004,,,,,,,,,
17782055,�G���_��,no,no,no,,,,"",,"",,,,,,"Kita Y, Masaki T, 8 others (10^<th>)",Expression of G1 phase-related cell cycle molecules in naturally developing hepatocellular carcinoma of Long-Evans Cinnamon rats.,,,,,,1205,1211,2004,2004,,,,,,,,,
17782056,�G���_��,no,no,no,,,,"",,"",,,,,,"Funakoshi F, Masaki T, 7 others (9^<th>)",Proliferative capability of hepatocytes and expression of G1-related cell cycle molecules in the development of liver cirrhosis in rats.,,,,,,779,787,2004,2004,,,,,,,,,
17782060,�G���_��,no,no,no,,,,"",,"",,,,,,"Morishita A, Masaki T, 15 others (17^<th>)",Reduced expression of cell cycle regulator p18INK4C in human hepatocellular carcinoma.,,,,,,677,686,2004,2004,,,,,,,,,
17782062,�G���_��,no,no,no,,,,"",,"",,,,,,"Yoshida S, Masaki T, 10 others (12^<th>)",Enhanced expression of adaptor molecule p46 Shc in nuclei of hepatocellular carcinoma cells : Study of LEC rats.,,,,,,1089,1096,2004,2004,,,,,,,,,
17782064,�G���_��,no,no,no,,,,"",,"",,,,,,"Li JQ, Wu F, Masaki T, 7others (9^<th>)","Correlation of Skp2 with carcinogenesis, invasion, metastasis, and prognosis in colorectal tumors.",,,,,,87,95,2004,2004,,,,,,,,,
17782065,�G���_��,no,no,no,,,,"",,"",,,,,,"Kurokohchi K, Masaki T, 10 others (12^<th>)",Efficacy of combination therapies of percutaneous or laparoscopic ethanol-lipiodol injection and radiofrequency ablation.,,,,,,1737,1743,2004,2004,,,,,,,,,
17782067,�G���_��,no,no,no,,,,"",,"",,,,,,"Kurokohchi K, Masaki T, 12others (14^<th>)",Successful laparoscopic radiofrequency ablation of hepatocellular carcinoma adhered to the mesentery after transcatheter arterial embolization.,,,,,,65,68,2005,2005,,,,,,,,,
17782072,�G���_��,no,no,no,,,,"",,"",,,,,,"Jin Y, Masaki T, Yoshida S, 8 others (11^<th>)",Identification of p46 Shc expressed in the nuclei of hepatocytes with high proliferating activity : Study of regenerating rat liver.,,,,,,721,728,2004,2004,,,,,,,,,
17782073,�G���_��,no,no,no,,,,"",,"",,,,,,"Kurokohchi K, Masaki T, 10 others (12^<th>)",Percutaneous ethanol and lipiodol injection therapy for hepatocellular carcinoma.,,,,,,381,387,2004,2004,,,,,,,,,
17782083,�G���_��,no,no,no,,,,"",,"",,,,,,"Li JQ, Wu F, Masaki T, 7 others (9^<th>)","Correlation of Skp2 with carcinogenesis, invasion, metastasis, and prognosis in colorecta tumors.",,,,,,87,95,2004,2004,,,,,,,,,
17782084,�G���_��,no,no,no,,,,"",,"",,,,,,"Kurokohchi K, Masaki T, 10 others (12^<th>)",Efficacy of combination therapies of percutaneous or laparoscopic ethanol-lipiodol injection and radio frequency ablation.,,,,,,1737,1743,2004,2004,,,,,,,,,
17782086,�G���_��,no,no,no,,,,"",,"",,,,,,"Kurokohchi K, Masaki T, 12 others (14^<th>)",Successful laparoscopic radiofrequency ablation of hepatocellular carcinoma adhered to the mesentery after transcatheter arterial embolization.,,,,,,65,68,2005,2005,,,,,,,,,
17782140,�G���_��,no,no,no,,,,"",,"",,,,,,"Kurokohchi K, Masaki T, 10 Others (11^<th>)",Percutaneous ethanol and lipiodol injection therapy for hepatocellular carcinoma,,,,,,381,387,2004,2004,,,,,,,,,
17782146,�G���_��,no,no,no,,,,"",,"",,,,,,"Morishita A, Masaki T, 15 others (17^<th>)",Reduced expression of cell cycle regulator p181NK4C in human hepatocellular carcinoma.,,,,,,677,686,2004,2004,,,,,,,,,
17782150,�G���_��,no,no,no,,,,"",,"",,,,,,"Li JQ, Wu F, Masaki T, 7 others (9^<th>)","Correlation of Skp2 with carcinogenesis, invasion, metastasis, and prognosis in colorectal tumors.",,,,,,87,95,2004,2004,,,,,,,,,
17782151,�G���_��,no,no,no,,,,"",,"",,,,,,"Kurokohchi K, Masaki T","Efficacy of combination therapies of percutaneous, or laparoscopic ethanol-lipiodol injection and radiofrequency ablation.",,,,,,1737,1743,2004,2004,,,,,,,,,
17782153,�G���_��,no,no,no,,,,"",,"",,,,,,"Kurokohchi K, Masaki T",Successful laparoscopic radiofrequency ablation of hepatocellular carcinoma adhered to the mesentery after transcatheter arterial embolization.,,,,,,65,68,2005,2005,,,,,,,,,
18564066,�G���_��,no,no,no,,,,"",,"",,,,,,"Masaki T, Shiratori Y, Rengifo W, 9 others",Cyclins and cyclin-dependent kinases : comparative study of hepatocellular carcinoma versus cirrhosis,,,,,,534,543,2003,2003,,,,,,,,,
18564068,�G���_��,no,no,no,,,,"",,"",,,,,,"Masaki T, Igarashi K, Tokuda M, 11 others",pp60^<c-src> Activation in Lung Adenocarcinoma.,,,,,,1447,1455,2003,2003,,,,,,,,,
18564070,�G���_��,no,no,no,,,,"",,"",,,,,,"Yuji J, Masaki T, Yoshida S, 9 others",Identification of p46Shc overexpressed in hepatoccellular nuclei with high proliferative activity : study of regenerating rat liver.,,,,,,721,728,2004,2004,,,,,,,,,
18564071,�G���_��,no,no,no,,,,"",,"",,,,,,"Li JQ, Wu F, Masaki T, 7 ohters","Correlation of Skp2 with carcinogenesis, invasion, metastasis, and prognosis in colorectal tumors.",,,,,,87,95,2004,2004,,,,,,,,,
18564072,�G���_��,no,no,no,,,,"",,"",,,,,,"Morishita A, Masaki T, Yoshiji H, 14 others",Reduced Expression of Cell Cycle Regulator p18^<INK4C> in Human Hepatocellular Carcinoma,,,,,,677,686,2004,2004,,,,,,,,,
18564073,�G���_��,no,no,no,,,,"",,"",,,,,,"Yoshida S, Masaki T, Feng H, 9 others",Enhanced expression of adaptor molecule p46Shc in nuclei of hepatocellular carcinoma study of Lec rats,,,,,,1089,1096,2004,2004,,,,,,,,,
18564075,�G���_��,no,no,no,,,,"",,"",,,,,,"Masaki T, Tokuda M, Yoshida S, 16 others","Expression of myristoylated alanine-rich C kinase substrate (MARCKS) in hepatocellular carcinoma : comparative study of hepatocellular carcinoma versus liver cirrhosis, chronic hepatitis and normal liver.",,,,,,661,671,2005,2005,,,,,,,,,
18564076,�G���_��,no,no,no,,,,"",,"",,,,,,"Yukimasa S, Masaki T, Funaki T, 13 others",Enhanced expression of adaptor molecule p46 Shc in nuclei of gastric cancer.,,,,,,905,911,2005,2005,,,,,,,,,
18564077,�G���_��,no,no,no,,,,"",,"",,,,,,"Masaki T, Shiratori Y, Rengifo W, 9 others.",Cyclins and cyclin-dependent kinases : comparative study of hepatocellular carcinoma versus cirrhosis.,,,,,,534,543,2003,2003,,,,,,,,,
18564079,�G���_��,no,no,no,,,,"",,"",,,,,,"Masaki T, Igarashi K, Tokuda M, 11 others.",pp60^<c-src> Activation in Lung Adenocarcinoma.,,,,,,1447,1455,2003,2003,,,,,,,,,
18564081,�G���_��,no,no,no,,,,"",,"",,,,,,"Yuji J, Masaki T, Yoshida S, 9 others.",Identification of p46Shc overexpressed in hepatoccellular nuclei with high proliferative activity : study of regenerating rat liver.,,,,,,721,728,2004,2004,,,,,,,,,
18564082,�G���_��,no,no,no,,,,"",,"",,,,,,"Li JQ, Wu F, Masaki T, 7 others.","Correlation of Skp2 with carcinogenesis, invasion, metastasis, and prognosis in colorectal tumors.",,,,,,87,95,2004,2004,,,,,,,,,
18564083,�G���_��,no,no,no,,,,"",,"",,,,,,"Morishita A, Masaki T, Yoshiji H, 14 others.",Reduced Expression of Cell Cycle Regulator p18^<INK4C> in Human Hepatocellular Carcinoma.,,,,,,677,686,2004,2004,,,,,,,,,
18564084,�G���_��,no,no,no,,,,"",,"",,,,,,"Yoshida S, Masaki T, Feng H, 9 others.",Enhanced expression of adaptor molecule p46Shc in nuclei of hepatocellular carcinoma : study of Lec rats.,,,,,,1089,1096,2004,2004,,,,,,,,,
18564086,�G���_��,no,no,no,,,,"",,"",,,,,,"Masaki T, Tokuda M, Yoshida S, 16 others.","Expression of myristoylated alanine-rich C kinase substrate(MARCKS)in hepatocellular carcinoma : comparative study of hepatocellular carcinoma versus liver cirrhosis, chronic hepatitis and normal liver.",,,,,,661,671,2005,2005,,,,,,,,,
18564087,�G���_��,no,no,no,,,,"",,"",,,,,,"Yukimasa S, Masaki T, Funaki T, 13 others.",Enhanced expression of adaptor molecule p46 Shc in nuclei of gastric cancer.,,,,,,905,911,2005,2005,,,,,,,,,
18564094,�G���_��,no,no,no,,,,"",,"",,,,,,"Masaki T, Shiratori Y, Rengifo W, 9 others",Cyclins and cyclin-dependent kinases : comparative study of hepatocellular carcinoma versus cirrhosis.,,,,,,534,543,2003,2003,,,,,,,,,
18564099,�G���_��,no,no,no,,,,"",,"",,,,,,"Li JQ, Wu F, Masaki T, 7 others","Correlation of Skp2 with carcinogenesis, invasion, metastasis, and prognosis in colorectal tumors.",,,,,,87,95,2004,2004,,,,,,,,,