��������ID,�������ʎ��,���ǂ̗L��,���ҍu�����ǂ���,�O�����ǂ���,DOI,PubMedID,PubMedCID,ISSN,J-GLOBAL ID,ISBN,NAID:CiNii Books or Articles��ID,�Y�ƍ��Y�� �������,�Y�ƍ��Y�� �o��ԍ�,�Y�ƍ��Y�� ���J�ԍ�,URL,���Җ��E���\�Җ�,�^�C�g��,�^�C�g���i�p��j,�w�,�o�Ŏ�,��,��,�J�n�y�[�W,�I���y�[�W,�N,�N����,�Y�ƍ��Y�� ������,�Y�ƍ��Y�� ������/�o��l,�Y�ƍ��Y�� �o��N,�Y�ƍ��Y�� �o��N����,�Y�ƍ��Y�� �擾�N,�Y�ƍ��Y�� �擾�N����,�Y�ƍ��Y�� ���J�N,�Y�ƍ��Y�� ���J�N����,�����e�L�X�g
11543609,�w��\,no,no,no,,,,"",,"",,,,,,Lrong Lim,"International Higher Education in Japan: 'Returning ' through the 300, 000 International Students Plan",,lobal Higher Education Forum,,,,,,2009,2009,,,,,,,,,
11543619,�w��\,no,no,no,,,,"",,"",,,,,,Lrong Lim,"Japan's 300, 000 International Student Plan",,"Asia-Pacific Sub-Regional Preparatory Conference for the 2009 World Conference on Higher Education, UNESCO",,,,,,2008,2008/9/25,,,,,,,,,
11543646,�w��\,no,no,no,,,,"",,"",,,,,,Lrong Lim,"Japan's 300, 000 International student Plan",,"Asia-Pacific Sub-Regional Preparatory Conference for the 2009 World Conference on Higher Education, UNESCO",,,,,,2008,2008/9/25,,,,,,,,,
11543661,�w��\,no,no,no,,,,"",,"",,,,,,Lrong Lim,International higher education in Japan : 'Retuning' through the 300000 international students plan,,Global Higher Education Forum(GHEF)2009,,,,,,2009,2009,,,,,,,,,
18780002,�G���_��,no,no,no,,,,"",,"",,,,,,"Itakura Hiroaki, Lrong Lim",The Imabari Towel Industry : The Remaking of the Japan Brand,,,,,,,,2006,2006,,,,,,,,,
18780003,�G���_��,no,no,no,,,,"",,"",,,,,,"Itakura Hiroaki, Lrong Lim",The Imabari Towel Industry: The Remaking of the Japan Brand,,,,,,,,2006,2006,,,,,,,,,
18780004,�G���_��,no,no,no,,,,"",,"",40007333328,,,,,"Lrong Lim, �q�G��",�ٕ����}�l�W�����g�����ɂ�������@�_��̏����ƑΉ�,,,,,,106,110,2004,2004,,,,,,,,,
18780005,�G���_��,no,no,no,,,,"",,"",110003743060,,,,,"Lrong Lim, �q�G��, �� �Ə�",���[�_�[�̉e���헪����,,,,,,,,2004,2004,,,,,,,,,
18780006,�G���_��,no,no,no,,,,"",,"",,,,,,"Lrong Lim, K.Praveen Parboteeah, John B.Cullen",Formal volunteering : a cross-national test,,,,,,431,441,2004,2004,,,,,,,,,
18780007,�G���_��,no,no,no,,,,"",,"",,,,,,"HIROAKI ITAKURA, LRONG LIM",The Resurgence of the Imabari Towel Industry: the fit between technology and industrial system,,,,,,1,15,2006,2006,,,,,,,,,
18860563,�G���_��,no,no,no,,,,"",,"",,,,,,"Hiroaki Itakura, Lim Lrong Yew",The Imabari Towel Industry : The Remaking of the Japan Brand,,,,,,1,24,2006,2006,,,,,,,,,
18860571,�G���_��,no,no,no,,,,"",,"",,,,,,"Hiroaki Itakura, Lim Lrong Yew, The Imabari Towel Industry",The Remaking of the Japan Brand,,,,,,,,2006,2006,,,,,,,,,
18860577,�G���_��,no,no,no,,,,"",,"",,,,,,"Hiroaki Itakura, Lrong Lim",An Empirical Research of IT Governance in Japanese Corporations,,,,,,1,20,2006,2006,,,,,,,,,
