��������ID,�������ʎ��,���ǂ̗L��,���ҍu�����ǂ���,�O�����ǂ���,DOI,PubMedID,PubMedCID,ISSN,J-GLOBAL ID,ISBN,NAID:CiNii Books or Articles��ID,�Y�ƍ��Y�� �������,�Y�ƍ��Y�� �o��ԍ�,�Y�ƍ��Y�� ���J�ԍ�,URL,���Җ��E���\�Җ�,�^�C�g��,�^�C�g���i�p��j,�w�,�o�Ŏ�,��,��,�J�n�y�[�W,�I���y�[�W,�N,�N����,�Y�ƍ��Y�� ������,�Y�ƍ��Y�� ������/�o��l,�Y�ƍ��Y�� �o��N,�Y�ƍ��Y�� �o��N����,�Y�ƍ��Y�� �擾�N,�Y�ƍ��Y�� �擾�N����,�Y�ƍ��Y�� ���J�N,�Y�ƍ��Y�� ���J�N����,�����e�L�X�g
11741140,�G���_��,yes,no,no,,,,"",,"",,,,,,"Tatsuya Sawasaki, et. al.",Arabidopsis HY5 protein functions as a DNA-binding tag for purification and functional immobilization of proteins on agarose/DNA microplate,,,,,,221,228,2008,2008,,,,,,,,,
11741147,�G���_��,yes,no,no,,,,"",,"",,,,,,"Sawasaki T, et al.","RIP and RALyase cleave the sarcin/ricin domain, a critical domain for ribosome function, during senescence of wheat coleoptiles.",,,,,,561,565,2008,2008,,,,,,,,,
12586766,�G���_��,no,no,no,,,,"",,"",,,,,,"Tsuboi T, Takeo S, Sawasaki T, Torii M, Endo Y",An efficient approach to the production of vaccines against the malaria parasite,,,,607,,73,83,2010,2010,,,,,,,,,
13087941,�G���_��,yes,no,no,,,,"",,"",10027702720,,,,,"Nagamangala Kanchiswamy C., Muroi A., Maffei, M.E., Yoshioka T., Sawasaki T., Arimura G.",Ca^<2+>-dependent protein kinases and their substrate HsfB2a are differently involved in the heat response signaling pathway in Arabidopsis.,,,,,,469,473,2010,2010,,,,,,,,,
13087943,�G���_��,no,no,no,,,,"",,"",,,,,,"Arimura G., Sawasaki T.",Arabidopsis CPK3 plays extensive roles in various biological and environmental responses.,,,,,,1263,1265,2010,2010,,,,,,,,,
13087961,�G���_��,yes,no,no,,,,"",,"",10027702720,,,,,"Nagamangala Kanchiswamy C., Muroi A., Maffei, M.E., Yoshioka T., Sawasaki T., Arimura G.",Ca^<2+>-dependent protein kinases and their substrate HsfB2a are differently involved in the heat response signaling pathway in Arabidopsis,,,,27,,469,473,2010,2010,,,,,,,,,
13087962,�G���_��,yes,no,no,,,,"",,"",,,,,,"Nagamangala Kanchiswamy C., Takahashi, H.Quadro S., Maffei M.E., Bossi S., Bertea C., Atsbaha Zebelo S., Muroi A., Ishihama N., Yoshioka H., Boland W., Takabayashi J., Endo Y., Sawasaki T., Arimura G.",Regulation of Arabidopsis defense responses against Spodoptera littoralis by CPK mediated calcium signaling,,,,10,,97,97,2010,2010,,,,,,,,,
13087964,�G���_��,no,no,no,,,,"",,"",,,,,,"Arimura G., Sawasaki T.",Arabidopsis CPK3 plays extensive roles in various biological and environmental responses,,,,5,,1263,1265,2010,2010,,,,,,,,,
13269311,�G���_��,yes,no,no,,,,"",,"",,,,,,"Iwasaki T, Katayama T, Kohama K, Endo Y, Sawasaki T",Myosin phosphatase is inactivated by caspase-3 cleavage and phosphorylation of myosin phosphatase targeting subunit 1 during apoptosis,,,,24,,748,56,2013,2013,,,,,,,,,
13269312,�G���_��,yes,no,no,,,,"",,"",,,,,,"Mizutani Y, Matsuoka K, Takeda H, Shiogama K, Inada KI, Hayakawa K, Yamada H, Miyazaki T, Sawasaki T, Endo Y, Tsutsumi Y.",Novel approach to identifying autoantibodies in rheumatoid synovitis with a biotinylated human autoantigen library and the enzyme-labeled antigen method,,,,387,,57,70,2013,2013,,,,,,,,,
13269313,�G���_��,yes,no,no,,,,"",,"",,,,,,"Miyakawa K, Sawasaki T, Matsunaga S, Tokarev A, Quinn G, Kimura H, Nomaguchi M, Adachi A, Yamamoto N, Guatelli J, Ryo A",Interferon-Induced SCYL2 Limits Release of HIV-1 by Triggering PP2A-Mediated Dephosphorylation of the Viral Protein Vpu.,,,,5,,,,2012,2012,,,,,,,,,
13269314,�G���_��,yes,no,no,,,,"",,"",,,,,,"Shimizu K, Takahama S, Endo Y, Sawasaki T",Stress-Inducible Caspase Substrate TRB3 Promotes Nuclear Translocation of Procaspase-3,,,,7,,,,2012,2012,,,,,,,,,
13269315,�G���_��,yes,no,no,,,,"",,"",,,,,,"Takahashi H, Ozawa A, Nemoto K, Nozawa A, Seki M, Shinozaki K, Takeda H, Endo Y, Sawasaki T.",Genome-wide biochemical analysis of Arabidopsis protein phosphatase using a wheat cell-free system.,,,,586,,3134,3141,2012,2012,,,,,,,,,
13269316,�G���_��,yes,no,no,,,,"",,"",,,,,,"Kominami K, Nakabayashi J, Nagai T, Tsujimura Y, Chiba K, Kimura H, Miyawaki A, Sawasaki T, Yokota H, Manabe N, Sakamaki K",The molecular mechanism of apoptosis upon caspase-8 activation: Quantitative experimental validation of a mathematical model,,,,1823,,1825,1840,2012,2012,,,,,,,,,
13269317,�G���_��,yes,no,no,,,,"",,"",,,,,,"Matsunaga S, Sawasaki T, Ode H, Morishita R, Furukawa A, Sakuma R, Sugiura W, Sato H, Katahira M, Takaori-Kondo A, Yamamoto N, Ryo A",Molecular and enzymatic characterization of XMRV protease by a cell-free proteolytic analysis.,,,,75,,4863,4873,2012,2012,,,,,,,,,
13269318,�G���_��,yes,no,no,,,,"",,"",,,,,,"Kiba A, Nakano M, Vincent-Pope P, Takahashi H, Sawasaki T, Endo Y, Ohnishi K, Yoshioka H, Hikichi Y. A","novel Sec14 phospholipid transfer protein from Nicotiana benthamiana is up-regulated in response to Ralstonia solanacearum infection, pathogen associated molecular patterns and effector molecules and involved in plant immunity.",,,,169,,1017,1022,2012,2012,,,,,,,,,
13269319,�G���_��,yes,no,no,,,,"",,"",,,,,,"Nozawa A, Ogasawara T, Matsunaga S, Iwasaki T, Sawasaki T, Endo Y",Production and partial purification of membrane proteins using a liposome-supplemented wheat cell-free translation system.,,,,11,,35,35,2011,2011,,,,,,,,,
13269320,�G���_��,yes,no,no,,,,"",,"",,,,,,"Akagi T, Shimizu K, Takahama S, Iwasaki T, Sakamaki K, Endo Y, Sawasaki T",Caspase-8 cleavage of the interleukin-21 (IL-21) receptor is a negative feedback regulator of IL-21 signaling.,,,,585,,1835,1840,2011,2011,,,,,,,,,
13269321,�G���_��,yes,no,no,,,,"",,"",,,,,,"Nemoto K, Seto T, Takahashi H, Nozawa A, Seki M, Shinozaki K, Endo Y, Sawasaki T.",Autophosphorylation profiling of Arabidopsis protein kinases using the cell-free system.,,,,72,,1136,1144,2011,2011,,,,,,,,,
13269322,�G���_��,yes,no,no,,,,"",,"",,,,,,"Tsuge S, Mizutani Y, Matsuoka K, Sawasaki T, Endo Y, Naruishi K, Maeda H, Takashiba S, Shiogama K, Inada KI, Tsutsumi Y.",Specific In Situ Visualization of Plasma Cells Producing Antibodies Against Porphyromonas Gingivalis in Gingival Radicular Cyst: Application of the Enzyme-Labeled Antigen Method.,,,,59,,673,689,2011,2011,,,,,,,,,
13269323,�G���_��,yes,no,no,,,,"",,"",,,,,,"Makino S, Sawasaki T, Endo Y, Takai K",Use of domain enzymes from wheat RNA ligase for in vitro preparation of RNA molecules.,,,,404,,1050,1054,2011,2011,,,,,,,,,
13269324,�G���_��,yes,no,no,,,,"",,"",,,,,,"Tadokoro D, Takahama S, Shimizu K, Hayashi S, Endo Y, Sawasaki T.",Characterization of a caspase-3-substrate kinome using an N- and C-terminally tagged protein kinase library produced by a cell-free system.,,,,1,,,,2010,2010,,,,,,,,,
13269325,�G���_��,yes,no,no,,,,"",,"",,,,,,"Matsuoka K, Komori H, Nose M, Endo Y, Sawasaki T.",Simple screening method for autoantigen proteins using the N-terminal biotinylated protein library produced by wheat cell-free synthesis.,,,,9,,4264,4273,2010,2010,,,,,,,,,
13269326,�G���_��,yes,no,no,,,,"",,"",,,,,,"Makino S, Sawasaki T, Endo Y, Takai K",In vitro dissection revealed that the kinase domain of wheat RNA ligase is physically isolatable from the flanking domains as a non-overlapping domain enzyme.,,,,397,,762,726,2010,2010,,,,,,,,,
13269327,�G���_��,yes,no,no,,,,"",,"",,,,,,"Matsunaga S, Matsuoka K, Shimizu K, Endo Y, Sawasaki T.",Biotinylated-sortase self-cleavage purification (BISOP) method for cell-free produced proteins.,,,,10,,42,42,2010,2010,,,,,,,,,
13269328,�G���_��,yes,no,no,,,,"",,"",,,,,,"Takai K, Sawasaki T, Endo Y.",Practical cell-free protein synthesis system using purified wheat embryos.,,,,5,,227,238,2010,2010,,,,,,,,,
13269329,�G���_��,yes,no,no,,,,"",,"",10027083539,,,,,"Tanaka Y, Komori H, Mori S, Soga Y, Tsubaki T, Terada M, Miyazaki T, Fujino T, Nakamura S, Kanno H, Sawasaki T, Endo Y, Nose M",Evaluating the role of rheumatoid factors for the development of rheumatoid arthritis in a mouse model with a newly established ELISA system.,,,,220,,199,206,2010,2010,,,,,,,,,
13269330,�G���_��,no,no,no,,,,"",,"",,,,,,"Madono M, Sawasaki T, Morishita R, Endo Y.",Wheat germ cell-free protein production system for post-genomic research.,,,,28,,211,217,2010,2010,,,,,,,,,
13269331,�G���_��,yes,no,no,,,,"",,"",,,,,,"Takai K, Sawasaki T, Endo Y.",The Wheat-Germ Cell-Free Expression System.,,,,11,,272,278,2010,2010,,,,,,,,,
13269332,�G���_��,no,no,no,,,,"",,"",,,,,,"Sawasaki T, Endo Y.",Cell-free-based protein microarray technology using agarose/DNA microplate,,,,607,,63,72,2010,2010,,,,,,,,,
13269333,�G���_��,no,no,no,,,,"",,"",,,,,,"Tsuboi T, Takeo S, Sawasaki T, Torii M, Endo Y",An efficient approach to the production of vaccines against the malaria parasite.,,,,607,,73,83,2010,2010,,,,,,,,,
13269334,�G���_��,no,no,no,,,,"",,"",,,,,,"Watanabe M, Miyazono K, Tanokura M, Sawasaki T, Endo Y, Kobayashi I.",Cell-free protein synthesis for structure determination by X-ray crystallography.,,,,607,,149,160,2010,2010,,,,,,,,,
13269335,�w��\,no,no,no,,,,"",,"",,,,,,"��� ���G, ���� ��d��, �V�� �B��",�A�|�g�[�V�X���ɂ�����~�I�V���z�X�t�@�^�[�[�������ߋ@�\,,��62����{�זE�����w����,,,,,,2010,2010,,,,,,,,,
13269336,�w��\,no,no,no,,,,"",,"",,,,,,"���� �N��, ���_ ���g, ���� ��d��, �V�� �B��",TRB3 �� caspase-3 �ɐؒf����邩�ǂ����͍זE�����ƍזE���̃^�[�j���O�|�C���g�̈�ł���,,��62����{�זE�����w����,,,,,,2010,2010,,,,,,,,,
13269337,�w��\,no,no,no,,,,"",,"",,,,,,"�V�� �B��, �����a�O, ���� ��d��",�^���p�N�����C�u�����[��p�������ȍR�̃v���t�@�C�����O,,���{�q�g�v���e�I�[���@�\��8����,,,,,,2010,2010,,,,,,,,,
13269338,�w��\,no,no,no,,,,"",,"",,,,,,"Mamoru Takahashi, Saki Miyajima, Tomio Ogasawara, Yaeta Endo, Tatsuya Sawasaki",Development of cell-free based proteoliposome technology for delivering membrane proteins to cells,,�v���e�C���A�C�����h���R���ۃV���|�W�E�� 2010,,,,,,2010,2010/9/28,,,,,,,,,
13269339,�w��\,no,no,no,,,,"",,"",,,,,,"Saki Yasuoka, Yaeta Endo, Tatsuya Sawasaki",Screening of cancer-related E3 ubiquitin ligases by wheat cell-free system,,�v���e�C���A�C�����h���R���ۃV���|�W�E�� 2010,,,,,,2010,2010/9/28,,,,,,,,,
13269340,�w��\,no,no,no,,,,"",,"",,,,,,"Keiichirou Nemoto, Takuya Seto, Motoaki Seki, Kazuo Shinozaki, Yaeta Endo and Tatsuya Sawasaki",Autophosphorylation profiling of Arabidopsis protein kinases using the cell-free system,,�v���e�C���A�C�����h���R���ۃV���|�W�E�� 2010,,,,,,2010,2010/9/28,,,,,,,,,
13269341,�w��\,no,no,no,,,,"",,"",,,,,,"K Takahiro Iwasaki, Yaeta Endo and Tatsuya Sawasaki",Downregulation of myosin phosphatase targeting subunit 1 during apoptosis,,�v���e�C���A�C�����h���R���ۃV���|�W�E�� 2010,,,,,,2010,2010/9/28,,,,,,,,,
13269342,�w��\,no,no,no,,,,"",,"",,,,,,"Shouta Hayashi, Kouhei imizu, Toshiaki Hashimoto, Ushio Kikkawa, Shinji Kamada, Yaeta Endo and Tatuya Sawasaki","Biochemical comparison among of Caspase-3,6,7-cleaved protein kinases",,�v���e�C���A�C�����h���R���ۃV���|�W�E�� 2010,,,,,,2010,2010/9/28,,,,,,,,,
13269343,�w��\,no,no,no,,,,"",,"",,,,,,"Kouhei Shimizu, Shoukichi Takahama, Yaeta Endo and Tatsuya Sawasaki",Caspase-3 cleavage of stress-responsible TRB3 reduces Akt activity and increases caspase-3 activity,,�v���e�C���A�C�����h���R���ۃV���|�W�E�� 2010,,,,,,2010,2010/9/28,,,,,,,,,
13269344,�w��\,no,no,no,,,,"",,"",,,,,,"������, �{�����I, ���}���x�v, ������d��, �V�� �B��",���זE��Ճv���e�I���|�\�[����p�����זE�ւ̖��^���p�N�������Z�p�̊J��,,��5�񖳍זE�����Ȋw������,,,,,,2010,2010/9/29,,,,,,,,,
13269345,�w��\,no,no,no,,,,"",,"",,,,,,"�яˑ�, �����N��, ���{�G��, �g�쒪, ���c�^�i, ������d��, �V�� �B��","Caspase-3,6,7 �ɂ��ؒf�����v���e�C���J�C�l�[�X�̔�r",,��5�񖳍זE�����Ȋw������,,,,,,2010,2010/9/29,,,,,,,,,
13269346,�w��\,no,no,no,,,,"",,"",,,,,,"���{�\��Y, �������, �֌���, ���Y, ������d��, �V�� �B��",�A�� Protein Kinase ���C�u�����[��p����Plant Protein Tyrosine Kinase �̒T���Ɠ���,,��5�񖳍זE�����Ȋw������,,,,,,2010,2010/9/29,,,,,,,,,
13269347,�w��\,no,no,no,,,,"",,"",,,,,,"�������N, ������d��, �V�� �B��",�R���M���זE�n����ՂƂ������񉻑��i���r�L�`���� E3 ���K�[�[�̒T��,,��5�񖳍זE�����Ȋw������,,,,,,2010,2010/9/29,,,,,,,,,
13269348,�w��\,no,no,no,,,,"",,"",,,,,,"�L������Y, Chidananda Nagamangala Kanchiswam, �����G��, �g������, ������d��, �V�� �B��",���זE�^���p�N�������n��p�����A���̃J���V�E���ˑ������_������@�\�̉�,,��5�񖳍זE�����Ȋw������,,,,,,2010,2010/9/29,,,,,,,,,
13269349,�w��\,no,no,no,,,,"",,"",,,,,,"�V�� �B��, ���� ��d��",���זE�n��p�����@�\�v���e�I�~�N�X�Z�p�ƃE�C���X�����ւ̉��p,,��58����{�E�C���X�w��w�p�W��,,,,,,2010,2010,,,,,,,,,
13269350,�w��\,no,no,no,,,,"",,"",,,,,,"���� ���u, ���Y �i, �V�� �B��, ���i �q�q, ���� ��d��, �F ���u, Robert Shafer, �R�{ ����, �� ���G",�y�f�������w�W�Ƃ��� HIV �v���e�A�[�[��ܑϐ��V�K�����@�̊J��,,��58����{�E�C���X�w��w�p�W��,,,,,,2010,2010,,,,,,,,,
13269351,�w��\,no,no,no,,,,"",,"",,,,,,"���� ����,���i �q�q,���� �G��,���� �F��,���� ��d��,�V�� �B��,�e�c ����, ��� �N�N",HCV NS5A �`���̃����_���Ɋ֗^����V�K�Z����/ �X���I�j���v���e�C���L�i�[�[�̓���Ƌ@�\���,,��58����{�E�C���X�w��w�p�W��,,,,,,2010,2010,,,,,,,,,
13269352,�w��\,no,no,no,,,,"",,"",,,,,,������A�{�����I�A���}���x�v�A������d���A�V�� �B��,���זE��Ճv���e�I���|�\�[����p�����זE�ւ̖��^���p�N�������Z�p�̊J��,,BMB2010(��33����{���q�����w��N��E��83����{�����w���� �������),,,,,,2010,2010,,,,,,,,,
13269353,�w��\,no,no,no,,,,"",,"",,,,,,"��藲�G,������d��,�V�� �B��",Regulation of Myosin Phosphatase during Apoptosis,,BMB2010(��33����{���q�����w��N��E��83����{�����w���� �������),,,,,,2010,2010,,,,,,,,,
13269354,�w��\,no,no,no,,,,"",,"",,,,,,�яˑ��A�����N���A���{�G���A�g�쒪�A������d���A�V�� �B��,"Caspase-3,6,7�ɂ��ؒf�����v���e�C���J�C�l�[�X�̔�r",,BMB2010(��33����{���q�����w��N��E��83����{�����w���� �������),,,,,,2010,2010,,,,,,,,,
13269355,�w��\,no,no,no,,,,"",,"",,,,,,�����N���A���_���g�A������d���A�V�� �B��,Caspase-3 �ɂ��X�g���X������TRB3 �̐ؒf�͊����^ Akt ��������Caspase-3 ������������,,BMB2010(��33����{���q�����w��N��E��83����{�����w���� �������),,,,,,2010,2010,,,,,,,,,
13269356,�w��\,no,no,no,,,,"",,"",,,,,,�������N�A���X�ؓ֘N�A������d���A�V�� �B��,�R���M���זE�n����ՂƂ������񉻑��i���r�L�`���� E3 ���K�[�[�̒T��,,BMB2010(��33����{���q�����w��N��E��83����{�����w���� �������),,,,,,2010,2010,,,,,,,,,
13269357,�w��\,no,no,no,,,,"",,"",,,,,,"�����a�O,��{���v,�͑���n,���v���q,�V�� �B��,���R�c�k��",�זE���ɔ������E�`���̎��n��I�ϓ��̉��,,BMB2010(��33����{���q�����w��N��E��83����{�����w���� �������),,,,,,2010,2010,,,,,,,,,
13269358,�w��\,no,no,no,,,,"",,"",,,,,,"K. Nishimori, K Matsuoka, Y. Endo, T. Sawasaki",Development of a Cell-Free Based Screening Method to Identify Cancer Specific Autoantigen Proteins,,the 50th annual meeting the american society for cell biology,,,,,,2010,2010,,,,,,,,,
13269359,�w��\,no,no,no,,,,"",,"",,,,,,"S. Yasuoka, Y. Endo, T. Sawasaki",Screening of Cancer-Related E3 Ubiquitin Ligase by Wheat Cell-Free System,,the 50th annual meeting the american society for cell biology,,,,,,2010,2010,,,,,,,,,
13269360,�w��\,no,no,no,,,,"",,"",,,,,,"K. Miyakawa, T. Sawasaki, S. Matsunaga, N. Yamamoto, A. Ryo",Identification of a Host Factor Antagonizing Vpu-Mediated BST-2 /Tetherin Down-Regulation,,the 50th annual meeting the american society for cell biology,,,,,,2010,2010,,,,,,,,,
13269361,�w��\,no,no,no,,,,"",,"",,,,,,"S. Matsunaga, Y. Kojima, R. Morishita, T. Sawasaki, A. Ryo",An In Vitro Cleavage Assay System for XMRV Protease by Wheat-Germ Cell Free Protein Production.,,the 50th annual meeting the american society for cell biology,,,,,,2010,2010,,,,,,,,,
13269362,�w��\,no,no,no,,,,"",,"",,,,,,"���{�\��Y, �֌���, ���Y, ������d��, �V�� �B��",�R���M���זE�^���p�N�������n��p�����A���`���V���L�i�[�[(PPTK)�̖ԗ��I�T���E���肨��ы@�\���,,��52����{�A�������w��N��,,,,,,2011,2011,,,,,,,,,
13269363,�w��\,no,no,no,,,,"",,"",,,,,,"Keiko Kawauchi, Tan Song Hui, Gao Rong, Guo Alvin, Katsuhiko Iwasaki, Ichiro Harada, Hirotaka Takahashi, Tatsuya Sawasaki, Yaeta Endo, Yasuhiro Sawada",Mechanical Regulation and Implication of Cancer: Oncogene-Induced Cell Transformation Involves Proteolysis of the Mechano-Sensing Protein p130Cas,,��63����{�זE�����w����,,,,,,2011,2011,,,,,,,,,
13269364,�w��\,no,no,no,,,,"",,"",,,,,,"Kouhei Shimizu,Shoukichi Takahama, Tatsuya Sawasaki and Yaeta Endo",Caspase cleavage of ER stress-inducible TRB3 is a key switch from survival to cell death,,��63����{�זE�����w����,,,,,,2011,2011,,,,,,,,,
13269365,�w��\,no,no,no,,,,"",,"",,,,,,"Yaeta Endo, Tatsuya Sawasaki, Lassale Michael W.",An attempt to prepare membrane proteins using the wheat cell-free protein production system,,XXII International Congress and General Assembly of the IUCr,,,,,,2011,2011,,,,,,,,,
13269366,�w��\,no,no,no,,,,"",,"",,,,,,"N. Takemori, A. Takemori, K. Matsuoka, N. Matsushita, T. Sawasaki, Y. Endo, S. Higashiyama",AN ABSOLUTE QUANTIFICATION METHOD OF MOUSE TRANSMEMBRANE PROTEOME USING A COMBINATION OF WHEAT CELL-FREE SYNTHESIS AND MRM MASS SPECTROMETRY,,HUPO 2011,,,,,,2011,2011,,,,,,,,,
13269367,�w��\,no,no,no,,,,"",,"",,,,,,"Tomohiro Kanuma, Ayumi Kudoh, Nao Jounai, Fumihiko Takeshita, Tatsuya Sawasaki, Akihide Ryo",IMMUNE EVASION BY HIV-1PROTEASE-MEDIATED CLEAVAGE OF TANK-BINDING KINASE 1,,IUMS2011,,,,,,2011,2011,,,,,,,,,
13269368,�w��\,no,no,no,,,,"",,"",,,,,,"Atsushi Muroi, Tomio Ogasawara, Kyoko Shinya, Akiko Makino, Teridah E Ginting, Yaeta Endo, Tatsuya Sawasaki",I CONSTRUCTION OF INFLUENZA VIRUS-LIKE PARTICLES USING A LIPOSOME-SUPPLEMENTED WHEAT CELL-FREE TRANSLATION SYSTEM,,IUMS2011,,,,,,2011,2011,,,,,,,,,
13269369,�w��\,no,no,no,,,,"",,"",,,,,,"Satoko Matsunaga, Ayako Furukawa, Yoshitsugu Kojima, Ryo Morishita, Tatsuya Sawasaki, Akifumi Takaori-Konda, Wataru Sugiura, Masato Katahira, Akihide Ryo",AN IN VITRO CLEAVAGE ASSAY SYSTEM FOR XMRV PROTEASE BY WHEAT-GERM CELL FREE PROTEIN PRODUCTIO,,IUMS2011,,,,,,2011,2011,,,,,,,,,
13269370,�w��\,no,no,no,,,,"",,"",,,,,,"Nobuaki Takemori, Ayako Takemori, Kazuhiro Matsuoka, Natsuki Matsushita, Hiroyuki Takeda, Tatsuya Sawasaki, Yaeta Endo and Shigeki Higashiyama",Absolute quantitative analysis of mouse transmebrane proteome using a combination of wheat cell-free synthesis and MRM mass spectrometry,,�v���e�C���A�C�����h���R���ۃV���|�W�E�� 2011,,,,,,2011,2011/9/22,,,,,,,,,
13269371,�w��\,no,no,no,,,,"",,"",,,,,,"Shoukichi Takahama, Masaru Arimoto, Saki Miyajima, Takahiro Masaki, Keiichirou Nemoto, Takanobu Kato, Takaji Wakita, Tetsuro Suzuki, Yaeta Endo and Tatsuya Sawasaki",Kinome-wide screening reveals Sgk495 as a novel HCV NS3 substrate,,�v���e�C���A�C�����h���R���ۃV���|�W�E��2011,,,,,,2011,2011/9/22,,,,,,,,,
13269383,�G���_��,no,no,no,,,,"",,"",,,,,,"Sawasaki T, et al.",Characterization of a caspase-3-substrate kinome using an N- and C-terminally tagged protein kinase library produced by a cell-free system.,,,,607,,63,72,2010,2010,,,,,,,,,
13269386,�G���_��,no,no,no,,,,"",,"",,,,,,"Arimura GI., Sawasaki T.",Arabidopsis CPK3 plays extensive roles in various biological and environmental responses.,,,,5,,1263,1265,2010,2010,,,,,,,,,
13269387,�w��\,no,no,no,,,,"",,"",,,,,,�V��B��,���זE�n��p�����@�\�v���e�I�~�N�X�Z�p�ƃE�C���X�����ւ̉��p,,���{�E�C���X�w��,,,,,,2010,2010/11/8,,,,,,,,,
14156058,�G���_��,yes,no,no,10.1096/fj.12-222653,,,"",,"",,,,,,"Ishigami T, Abe K, Aoki I, Minegishi S, Ryo A, Matsunaga S, Matsuoka K, Taleda H, Sawasaki T, Umemura S, Endoh Y.",Anti-interleukin-5 and multiple autoantibodies are associated with human atherosclerotic diseases and serum interleukin-5 levels,,,,27,9,3437,45,2013,2013,,,,,,,,,
14465485,�G���_��,yes,no,no,10.1128/jvi.03170-13,,,"",,"",,,,,,"Masaki T, Matsunaga S, Takahashi H, Nakashima K, Kimura Y, Ito M, Matsuda M, Murayama A, Kato T, Hirano H, Endo Y, Lemon SM, Wakita T, Sawasaki T, Suzuki T",Involvement of Hepatitis C Virus NS5A Hyperphosphorylation Mediated by Casein Kinase I-�� in Infectious Virus Production.,,,,88(13),13,7541,55,2014,2014,,,,,,,,,
14671399,�G���_��,yes,no,no,10.1371/journal.pone.0108849,,,"",,"",,,,,,"Mitsunami T., Nishihara M., Galis I., Alamgir K.M., Hojo Y., Fujita K., Sasaki N., Nemoto K., Sawasaki T., Arimura G.",Overexpression of the PAP1 transcription factor reveals a complex regulation of flavonoid and phenylpropanoid metabolism in Nicotiana tabacum plants attacked by Spodoptera litura.,,,,9,9,e108849,e108849,2014,2014,,,,,,,,,
14891188,�G���_��,yes,no,no,10.1111/omi.12052,,,"",,"",,,,,,"Mizutani Y, Tsuge S, Takeda H, Hasegawa Y, Shiogama K, Onouchi T, Inada KI, Sawasaki T, Tsutsumi Y.",In situ visualization of plasma cells producing antibodies reactive to Porphyromonas gingivalis in periodontitis: The application of the enzyme-labeled antigen method.,,,,In press,4,156,173,2014,2014,,,,,,,,,
14920252,�G���_��,yes,no,no,10.1039/c4mb00556b,,,"",,"",,,,,,"Takemori N, Takemori A, Matsuoka K, Morishita R, Matsushita N, Aoshima M, Takeda H, Sawasaki T, Endo Y, Higashiyama S.",High-throughput synthesis of stable isotope-labeled transmembrane proteins for targeted transmembrane proteomics using a wheat germ cell-free protein synthesis system.,,,,11,2,361,365,2015,2015,,,,,,,,,
14925714,�G���_��,yes,no,no,10.1091/mbc.e11-08-0740,,,"",,"",,,,,,"Iwasaki T, Katayama T, Kohama K, Endo Y, Sawasaki T.",Myosin phosphatase is inactivated by caspase-3 cleavage and phosphorylation of myosin phosphatase targeting subunit 1 during apoptosis.,,,,24,6,748,756,2013,2013,,,,,,,,,
14925718,�G���_��,no,no,no,,,,"",,"",10031184264,,,,,"Sawasaki T, Takeda H, Takahashi H, Nemoto K.",Cell-free based protein array technology for analyses of protein kinases and ubiquitin ligases.,,,,85,,438,446,2013,2013,,,,,,,,,
14925719,�w��\,no,yes,no,,,,"",,"",,,,,,�V�� �B��,�R���M���זE�`���������Z�p�Ɠ�����o�C�I�}�[�J�[�T��,,���{�v���e�I�[���w���Ãv���e�I�T�C�G���X�Z���^�[�@JHUPO�T�e���C�g�W���C���g�V���|�W�E��,,,,,,,,,,,,,,,,
14925720,�w��\,no,yes,no,,,,"",,"",,,,,,�V�� �B��A�|�c �_�V,�n�򓙃v���b�g�t�H�[���ɂ�����R���M���זE��Ֆ��`�������Y�ƍ��e�a���`�����R�̍쐬�Z�p,,��13����{�`�����Ȋw��N��,,,,,,2013,2013,,,,,,,,,
14925721,�w��\,no,yes,no,,,,"",,"",,,,,,�V�� �B��A�|�c �_�V,�R���M���זE�`���������n����ՂƂ������^���p�N�����,,��65����{�זE�����w����,,,,,,2013,2013,,,,,,,,,
14925722,�w��\,no,yes,no,,,,"",,"",,,,,,"�V�� �B��, �|�c �_�V",�R���M���זE�`���������n����ՂƂ������`�����̍����E�����ƍזE�ւ̓����Z�p,,��65����{�זE�����w����,,,,,,2013,2013,,,,,,,,,
14925723,�w��\,no,yes,no,,,,"",,"",,,,,,"�V�� �B��, ���{ �\��Y, ���� �G��, �|�c �_�V",���זE�v���e�C���A���C��p�����v���e�C���L�i�[�[����у��r�L�`�����K�[�[�̊�^���p�N���T���Z�p,,��86����{�����w����,,,,,,2013,2013,,,,,,,,,
14925727,�G���_��,yes,no,no,10.1016/j.febslet.2014.05.060,,,"",,"",,,,,,"Shimizu K, Uematsu A, Imai Y, Sawasaki T.",Pctaire1/Cdk16 promotes skeletal myogenesis by inducing myoblast migration and fusion.,,,,588,17,3030,3037,2014,2014,,,,,,,,,
14925728,�G���_��,yes,no,no,10.1002/pmic.201400002,,,"",,"",,,,,,"Fu SC, Imai K, Sawasaki T, Tomii K.",creenCap3: Improving prediction of caspase-3 cleavage sites using experimentally verified noncleavage sites.,,,,14,17-18,2042,2046,2014,2014,,,,,,,,,
14925729,�G���_��,yes,no,no,10.1074/jbc.m114.561662,,,"",,"",,,,,,"Tan BH, Suzuki Y, Takahashi H, Ying PH, Takahashi C, Han Q, Chin WX, Chao SH, Sawasaki T, Yamamoto N, Suzuki Y.","Identification of RFPL3 protein as a novel E3 ubiquitin ligase modulating the integration activity of human immunodeficiency virus, type 1 preintegration complex using a microtiter plate-based assay.",,,,289,38,26368,26382,2014,2014,,,,,,,,,
14925730,�G���_��,yes,no,no,10.1093/molbev/msu260,,,"",,"",,,,,,"Sakamaki K, Shimizu K, Iwata H, Imai K, Satou Y, Funayama N, Nozaki M, Yajima M, Nishimura O, Higuchi M, Chiba K, Yoshimoto M, Kimura H, Gracey AY, Shimizu T, Tomii K, Gotoh O, Akasaka K, Sawasaki T, Miller DJ.",The apoptotic initiator caspase-8: its functional ubiquity and genetic diversity during animal evolution.,,,,31,12,3282,3301,2014,2014,,,,,,,,,
14925733,�G���_��,yes,no,no,10.1016/j.ejphar.2014.10.011,,,"",,"",,,,,,"Arimitsu E, Ogasawara T, Takeda H, Sawasaki T, Ikeda Y, Hiasa Y, Maeyama K.",The ligand binding ability of dopamine D1 receptors synthesized using a wheat germ cell-free protein synthesis system with liposomes.,,,,745,,117,122,2014,2014,,,,,,,,,