��������ID,�������ʎ��,���ǂ̗L��,���ҍu�����ǂ���,�O�����ǂ���,DOI,PubMedID,PubMedCID,ISSN,J-GLOBAL ID,ISBN,NAID:CiNii Books or Articles��ID,�Y�ƍ��Y�� �������,�Y�ƍ��Y�� �o��ԍ�,�Y�ƍ��Y�� ���J�ԍ�,URL,���Җ��E���\�Җ�,�^�C�g��,�^�C�g���i�p��j,�w�,�o�Ŏ�,��,��,�J�n�y�[�W,�I���y�[�W,�N,�N����,�Y�ƍ��Y�� ������,�Y�ƍ��Y�� ������/�o��l,�Y�ƍ��Y�� �o��N,�Y�ƍ��Y�� �o��N����,�Y�ƍ��Y�� �擾�N,�Y�ƍ��Y�� �擾�N����,�Y�ƍ��Y�� ���J�N,�Y�ƍ��Y�� ���J�N����,�����e�L�X�g
11662885,�G���_��,no,no,no,,,,"",,"",,,,,,"Joel M. ALCARAZ, Jun. YAMASHITA Kazunobu. SATO, Seiichi Arima",Development of a hybrid crawler tractor for agricultural transport,,,,,,34,37,2008,2008,,,,,,,,,
11662887,�G���_��,yes,no,no,,,,"",,"",,,,,,"Joel M. ALCARAZ, Jun. YAMASHITA Kazunobu. SATO, Seiichi, Arima",Development of a hybrid tractor for greenhouse operation,,,,,,44,47,2007,2007,,,,,,,,,
12093032,�w��\,no,no,no,,,,"",,"",,,,,,�L�n����E�m�ȍO�d�E�H�������E���R�O���Y�E����T�q�E�����G,���{�b�g�ɂ��A������f�f�����W�V�X�e���̍\�z,,��69��_�Ƌ@�B�w��N�����,,,,,,2010,2010/9/15,,,,,,,,,
12093039,�w��\,no,no,no,,,,"",,"",,,,,,"�L�n����, ��",���z�����p�^�m�I�A���H��ɂ����鐶��f�f���{�b�g�̊J��,,���{�������H�w��,,,,,,2008,2008/9/9,,,,,,,,,
12093045,�w��\,no,no,no,,,,"",,"",,,,,,�L�n����,����f�f���{�b�g�ɂ���񉻔_��,,���{�������H�w��2009�N���,,,,,,2009,2009,,,,,,,,,
12881291,�G���_��,no,no,no,,,,"",,"",,,,,,�����G�E�L�n����E����T�q,���w�I��@��p���������I�h���V�X�e���̊J��,,,,109��,,16,19,2011,2011,,,,,,,,,
12881292,�w��\,no,no,no,,,,"",,"",,,,,,�L�n����E����T�q�E�����G,���z�����p�^�A���H��ɂ����钎�̑����𗘗p���������I�h���V�X�e���̊J��,,��70��_�Ƌ@�B�w��N�����,,,,,,2011,2011/9/28,,,,,,,,,
12881293,�w��\,no,no,no,,,,"",,"",,,,,,�L�n����E����T�q�E�����G,���z�����p�^�A���H��ɂ�������A���𗘗p���������I�h���V�X�e���̊J��,,���{�������H�w��,,,,,,2011,2011/9/7,,,,,,,,,
12881294,�w��\,no,no,no,,,,"",,"",,,,,,�����G�E�L�n����E����T�q,���w�I��@��p���������I�h���V�X�e���̊J��,,��69��_�Ƌ@�B�w��N�����,,,,,,2010,2010/9/15,,,,,,,,,
12881295,�w��\,no,no,no,,,,"",,"",,,,,,�����G�E�L�n����E����T�q,�������˓����̈Ⴂ�ɂ�钎�̑������,,�_�Ƌ@�B�w��֐��x����124����,,,,,,2010,2010/8/31,,,,,,,,,
12881297,�w��\,no,no,no,,,,"",,"",,,,,,�����G�A�L�n����A����T�q,�������˓����̈Ⴂ�ɂ�钎�̑������,,�_�Ƌ@�B�w��֐��x����124����,,,,,,2010,2010/8/31,,,,,,,,,
12881298,�w��\,no,no,no,,,,"",,"",,,,,,�����G�A�L�n����A����T�q,���w�I��@��p���������I�h���V�X�e���̊J��,,��69��_�Ƌ@�B�w��N�����,,,,,,2010,2010/9/15,,,,,,,,,
12881300,�w��\,no,no,no,,,,"",,"",,,,,,�L�n����E����T�q�E�����G,���z�����p�^�A���H��ɂ����钎�̑����𗘗p���������I�h���V�X�e���̊J��,,�_�Ƌ@�B�w��,,,,,,2011,2011/9/28,,,,,,,,,
19184095,�G���_��,no,no,no,,,,"",,"",,,,,,�L�n ����,�����I��@��p�����h���V�X�e���J���̂��߂�,,,,,,33,38,2005,2005,,,,,,,,,
19184096,�G���_��,no,no,no,,,,"",,"",,,,,,�L�n ����,�_�Y���n�C�e�N���Y�V�X�e��(�V����A���H��)�̍\�z�Ɍ����Ď��O�E���̈�ɂ�����Ԃ̕������˓���,,,,,,,,2006,2006,,,,,,,,,
19184097,�G���_��,no,no,no,,,,"",,"",,,,,,"�X�c �K��Y, �L�n ����",�����I�h���V�X�e���̊J���Ɍ������A�������W,,,,,,1426,1426,2006,2006,,,,,,,,,
19184098,�G���_��,no,no,no,,,,"",,"",,,,,,"�X�c �K��Y, �L�n ����",�����I�h���V�X�e���̊J��-���O�E���̈�ɂ�����Ԃ̕������˓��������������ƕ���-,,,,,,48,51,2007,2007,,,,,,,,,
19184099,�G���_��,no,no,no,,,,"",,"",,,,,,SEIICHI ARIMA,Development of Pest Control System Using the Physical Way,,,,,,33,38,2005,2005,,,,,,,,,
19184100,�G���_��,no,no,no,,,,"",,"",,,,,,SEIICHI ARIMA,Spectral Reflection of Flowers in Ultraviolet and Visible Light Region,,,,,,,,2006,2006,,,,,,,,,
19184101,�G���_��,no,no,no,,,,"",,"",,,,,,"KOICHIRO MORITA, SEIICHI ARIMA",Collecting Information of Plants for Development of Physical Pest Control System,,,,,,1426,1426,2006,2006,,,,,,,,,
19184102,�G���_��,no,no,no,,,,"",,"",,,,,,"KOICHIRO MORITA, SEIICHI ARIMA",Development of Physical Pest Control System,,,,,,48,51,2007,2007,,,,,,,,,
19184104,�G���_��,no,no,no,,,,"",,"",,,,,,�L�n ����,�_�Y���n�C�e�N���Y�V�X�e��(�V����A���H��)�̍\�z�Ɍ����� ���O�E���̈�ɂ�����Ԃ̕������˓���,,,,,,,,2006,2006,,,,,,,,,
19184106,�G���_��,no,no,no,,,,"",,"",,,,,,"�X�c �K��Y, �L�n ����",�����I�h���V�X�e���̊J��-���O�E���̈�̂�����Ԃ̕������˓��������������ƕ���-,,,,,,48,51,2007,2007,,,,,,,,,
