��������ID,�������ʎ��,���ǂ̗L��,���ҍu�����ǂ���,�O�����ǂ���,DOI,PubMedID,PubMedCID,ISSN,J-GLOBAL ID,ISBN,NAID:CiNii Books or Articles��ID,�Y�ƍ��Y�� �������,�Y�ƍ��Y�� �o��ԍ�,�Y�ƍ��Y�� ���J�ԍ�,URL,���Җ��E���\�Җ�,�^�C�g��,�^�C�g���i�p��j,�w�,�o�Ŏ�,��,��,�J�n�y�[�W,�I���y�[�W,�N,�N����,�Y�ƍ��Y�� ������,�Y�ƍ��Y�� ������/�o��l,�Y�ƍ��Y�� �o��N,�Y�ƍ��Y�� �o��N����,�Y�ƍ��Y�� �擾�N,�Y�ƍ��Y�� �擾�N����,�Y�ƍ��Y�� ���J�N,�Y�ƍ��Y�� ���J�N����,�����e�L�X�g
20169316,�G���_��,yes,no,no,,,,"",,"",40020857570,,,,,"Mutsuko Nagasaki, Sunao Orimoto",Effects of oral rehearsal on L2 speaking improvement,,,,13,,52,69,2016,2016,,,,,,,,,
20169317,�w��\,no,no,no,,,,"",,"",,,,,,"Mutsuko Nagasaki, Sunao Orimoto",Effects of spoken rehearsal on L2 learning,,The JACET 54th International Convention,,,,,,2015,2015/8/31,,,,,,,,,
20169318,�w��\,no,no,no,,,,"",,"",,,,,,"Mutsuko Nagasaki, Sunao Orimoto, Kristin Armitage",Does oral practice work?: Effects of rehearsal and instruction on second language speaking improvement,,The JACET 55th International Convention,,,,,,2016,2016/9/1,,,,,,,,,
21153158,�w��\,no,no,no,,,,"",,"",,,,,,����r�q�C�ܖ{�f,��w�p��N���X�ɂ�����������n�[�T���ƃX�s�[�`�̎��H,,JACET���l���t�G�x�����,,,,,,2016,2016/6/4,,,,,,,,,
21153159,�w��\,no,no,no,,,,"",,"",,,,,,"Mutsuko Nagasaki, Sunao Orimoto, Kristin Armitage",Does Oral Practice Work?: Effects of Rehearsal and Instruction on Second Language Speaking Improvement,,The JACET 55th International Convention (���ۑ��),,,,,,2016,2016/9/3,,,,,,,,,
21832716,�w��\,no,no,no,,,,"",,"",,,,,,"Mutsuko Nagasaki, Sunao Orimoto, Armitage Kristin",Is the length of an oral rehearsal period a significant factor in second language speaking improvement?,,The JACET 56th International Convention,,,,,,2017,2017,,,,,,,,,
21832717,�w��\,no,no,no,,,,"",,"",,,,,,"Mutsuko Nagasaki, Sunao Orimoto, Armitage Kristin, Ikuyo Kaneko",Teaching and learning methods to improve speaking ability: Report of the 2015-2017 Kaken (C) Research.,,The 16th Ehime University English Education Seminar,,,,,,2017,2017,,,,,,,,,
22081209,�G���_��,yes,no,no,,,,"",,"",40021875161,,,,,"Nagasaki, M., Orimoto, S., & Armitage, K.",The contribution of noticing and self-modification through repetitive oral output to second language learners' monologic speaking performances,,,,16,,103,120,2019,2019,,,,,,,,,
22081212,�w��\,no,no,no,,,,"",,"",,,,,,"Nagasaki, M., Orimoto, S., & Armitage, K.",Benefits of Interactive and Individual Rehearsals for Developing Second Language Communication Ability,,JACET��58�񍑍ۊw��i���É��j,,,,,,2019,2019,,,,,,,,,
22654659,�w��\,no,no,no,,,,"",,"",,,,,,"Nagasaki, M., Orimoto, S., & Armitage, K.",Benefits of Interactive and Individual Rehearsals for Developing Second Language Communication Ability.,,"JACET 58th International Convention, Nagoya.",,,,,,2019,2019,,,,,,,,,
22654660,�w��\,no,no,no,,,,"",,"",,,,,,����r�q�E�ܖ{�f,��w�p��X�s�[�L���O�N���X�ɂ�����R�~���j�P�[�V�����\�͈琬�̂��߂�,,JACET���l���H�G�x�����,,,,,,2019,2019,,,,,,,,,
23582423,�G���_��,yes,no,no,10.1177/0033688220901348,,,"",,"",,,,,,"Mutsuko Nagasaki, Kristin Armitage, Sunao Orimoto",The Benefits of Interactive and Individual Rehearsals for Developing Second Language Communicative Ability,,,,Published online,3,474,492,2020,2020,,,,,,,,,
23582424,�w��\,no,no,no,,,,"",,"",,,,,,"Mutsuko Nagasaki, Sunao Orimoto, Kristin Armigate",How do oral rehearsals affect presentation and discussion skills in English?,,"55th RELC International Conference, Singapore.",,,,,,2021,2021,,,,,,,,,
24016453,�G���_��,yes,no,no,,,,"",,"",,,,,,"Nagasaki, M., Armitage, K., & Orimoto, S.",How do oral rehearsals and peer-feedback affect monologic and dyadic English speaking tasks?,,,,21,,1,10,2022,2022,,,,,,,,,
24016454,�w��\,no,no,no,,,,"",,"",,,,,,"Nagasaki, M., Orimoto, S., & Armitage, K.",Attempting to evaluate and improve non-verbal communication skills using an online platform,,"56th RELC International Conference, Online",,,,,,2022,2022,,,,,,,,,
24191332,�w��\,no,no,no,,,,"",,"",,,,,,"Nagasaki, M., Orimoto, S., and Armitage, K.",Creating a rubric for assessing non-verbal communication. The 57th RELC International Conference. �������\����,,"57th RELC International Conference, Singapore",,,,,,2023,2023,,,,,,,,,
