��������ID,�������ʎ��,���ǂ̗L��,���ҍu�����ǂ���,�O�����ǂ���,DOI,PubMedID,PubMedCID,ISSN,J-GLOBAL ID,ISBN,NAID:CiNii Books or Articles��ID,�Y�ƍ��Y�� �������,�Y�ƍ��Y�� �o��ԍ�,�Y�ƍ��Y�� ���J�ԍ�,URL,���Җ��E���\�Җ�,�^�C�g��,�^�C�g���i�p��j,�w�,�o�Ŏ�,��,��,�J�n�y�[�W,�I���y�[�W,�N,�N����,�Y�ƍ��Y�� ������,�Y�ƍ��Y�� ������/�o��l,�Y�ƍ��Y�� �o��N,�Y�ƍ��Y�� �o��N����,�Y�ƍ��Y�� �擾�N,�Y�ƍ��Y�� �擾�N����,�Y�ƍ��Y�� ���J�N,�Y�ƍ��Y�� ���J�N����,�����e�L�X�g
17988214,�G���_��,no,no,no,,,,"",,"",,,,,,"Nobuyoshi Fukagai, Kimiaki Narukawa",Multiple positive solutions of nonlinear eigenvalue problems associated to a class of p-Laplacian like operators,,,,,,737,759,2003,2003,,,,,,,,,
17988215,�G���_��,no,no,no,,,,"",,"",,,,,,"�[�L����, �ɓ����K, �������",Variational methods in Orlicz-Sobolev spaces to quasilinear elliptic equations,,,,,,14,30,2004,2004,,,,,,,,,
17988216,�G���_��,no,no,no,,,,"",,"",,,,,,"Nobuyoshi Fukagai, Kimiaki Narukawa",Multiple positive solutions of nonlinear eigenvalue problems associated to a class of p-Laplacian like operators,,,,,,737,759,2003,2003,,,,,,,,,
17988217,�G���_��,no,no,no,,,,"",,"",,,,,,"Nobuyoshi Fukagai, Masayuki Ito, Kimiaki Narukawa",Variational methods In Orlicz-Sobolev spaces to quasilinear elliptic equations,,,,,,14,30,2004,2004,,,,,,,,,
18790865,�G���_��,no,no,no,,,,"",,"",,,,,,�[�L����,Variational Methods in Orlicz-Sobolev spaces to quasilinear elliptic equations.,,,,,,14,30,2004,2004,,,,,,,,,
18790866,�G���_��,no,no,no,,,,"",,"",,,,,,N.Fukagai,Posistive solutions of quasilinear elliptic equations with critical Orlicz-Sobolev nonlinearity on R^N.,,,,,,235,267,2006,2006,,,,,,,,,
18790867,�G���_��,no,no,no,,,,"",,"",,,,,,N.Fukagai,On the existence of multiple positive solutions of quasilinear elliptic eigenvalue problems.,,,,,,,,,,,,,,,,,,
18790868,�G���_��,no,no,no,,,,"",,"",,,,,,N.Fukagai,Variational methods in Orlicz-Sobolev spaces to quasilinear elliptic equations.,,,,,,14,30,2004,2004,,,,,,,,,
18790869,�G���_��,no,no,no,,,,"",,"",,,,,,N.Fukagai,Positive solutions of quasilinear elliptic equations with critical Orlicz-Sobolev nonlinearity on R^N.,,,,,,235,267,2005,2005,,,,,,,,,
18790870,�G���_��,no,no,no,,,,"",,"",,,,,,N.Fukagai,On the existence of multiple positive solutions of quasilinear elliptic eigenvalue problems.,,,,,,,,,,,,,,,,,,
19046849,�G���_��,yes,no,no,,,,"",,"",,,,,,Nobuyoshi Fukagai,Quasilinear elliptic equations with slowly growing Principal part and critical Orlicz-Sobolev nonlinear term,,,,,,,,,,,,,,,,,,
19046852,�G���_��,no,no,no,,,,"",,"",,,,,,"Nobuyoshi, Fukagai, Masayuki, Ito, Kimiaki, Narukawa",Quasilinear elliptic equations with slowly growing principal part and critical Orlicz-Sobolev nonlinear term,,,,,,,,,,,,,,,,,,
19046854,�w��\,no,no,no,,,,"",,"",,,,,,"Nobuyoshi, Fukagai",Variational problem in Orlcz-Sobolev space for functionals whose principal parts have nearly linear growth,,Conference of the Mathematical Society of Japan,,,,,,2006,2006/3/27,,,,,,,,,
19046858,�G���_��,yes,no,no,,,,"",,"",,,,,,"Nobuyoshi Fukagai, Masayuki Ito and Kimiaki Narukawa",Quasilinear elliptic equations with slowly growing principal part and critical Orlicz-Sobolev nonlinear term,,,,,,,,,,,,,,,,,,
