��������ID,�������ʎ��,���ǂ̗L��,���ҍu�����ǂ���,�O�����ǂ���,DOI,PubMedID,PubMedCID,ISSN,J-GLOBAL ID,ISBN,NAID:CiNii Books or Articles��ID,�Y�ƍ��Y�� �������,�Y�ƍ��Y�� �o��ԍ�,�Y�ƍ��Y�� ���J�ԍ�,URL,���Җ��E���\�Җ�,�^�C�g��,�^�C�g���i�p��j,�w�,�o�Ŏ�,��,��,�J�n�y�[�W,�I���y�[�W,�N,�N����,�Y�ƍ��Y�� ������,�Y�ƍ��Y�� ������/�o��l,�Y�ƍ��Y�� �o��N,�Y�ƍ��Y�� �o��N����,�Y�ƍ��Y�� �擾�N,�Y�ƍ��Y�� �擾�N����,�Y�ƍ��Y�� ���J�N,�Y�ƍ��Y�� ���J�N����,�����e�L�X�g
21206718,�G���_��,no,no,no,,,,"",,"",,,,,,�c�v�� �_,"Review: Alex Watson and Nahoko Miyamoto Alvey, eds. Poetica: An International Journal of Linguistic-Literary Studies 82 Special Issue: Romantic Connections",,,,24,,14,16,2016,2016,,,,,,,,,
21206719,�G���_��,no,no,no,,,,"",,"",,,,,,�c�v�� �_,�W�F�C���E�I�[�X�e�B�������̉f�扻���߂�����,,,,24,,17,18,2016,2016,,,,,,,,,
21206720,�w��\,no,no,no,,,,"",,"",,,,,,�c�v�ہ@�_,�p���w�ƉĖڟ���,,�Ėڟ��΍��ۃV���|�W�E���u���΂͐��E���ǂ��ǂ񂾂��H�^���E�͟��΂��ǂ��ǂ�ł��邩�H�v,,,,,,2016,2016/12/9,,,,,,,,,
21206721,�}��,no,no,no,,,,"",,"",,,,,,"�����T�q�A���{�I�[�X�^�b�h��q�A�ѓc�S�q�A���p��Y�A���X�z��A�c�v�ۍ_�A�Ėږ[�V��AKeith Vincent, Michael K. Bourdaghs, �p�T�́A���L�u�A�я��z�ALucia Hornedo",���a150�N�@���E���w�Ƃ��ẲĖڟ���,,,��g���X,,,,,2017,2017,,,,,,,,,
21403230,�G���_��,no,no,no,,,,"",,"",120006371330,,,,,�c�v�� �_,�f���N���X�J�h�̎��ɂ����銴�󐫂̃C�f�I���M�[�Ə\�����I���f�B�A,,,,25,,1,22,2017,2017,,,,,,,,,
21403231,�w��\,no,no,no,,,,"",,"",,,,,,�c�v�ہ@�_,�f�b���E�N���X�J���̕\���ƃC�f�I���M�[����у��}���h�ւ̉e��,,�C�M���X�E���}���h�w��� 43 ��S�����,,,,,,2017,2017,,,,,,,,,
22429358,�G���_��,no,no,no,,,,"",,"",,,,,,�c�v�ہ@�_,Review: On the Bullet Train with Emily Bronte: Wuthering Heights in Japan,,,,26,,20,22,2018,2018,,,,,,,,,
22429359,�G���_��,no,no,no,,,,"",,"",,,,,,�c�v�ہ@�_,�՘H�ƕ��w�\�w�ł̉��x�ɂ����闷�ƕ���,,,,36,,15,25,2019,2019,,,,,,,,,
22429360,�w��\,no,no,no,,,,"",,"",,,,,,�c�v�ہ@�_,�V���|�W�E���F�@���w�Ə���,,���{�L���X�g�����w��S�����,,,,,,2018,2018,,,,,,,,,
22706729,�G���_��,yes,no,no,,,,"",,"",,,,,,�c�v�ہ@�_,"Michael O'Neill, Shelleyan Reimaginings and Influence",,,,44,,70,74,2020,2020,,,,,,,,,
23262701,�G���_��,no,no,no,,,,"",,"",120006951319,,,,,�c�v�ہ@�_,���o�[�g�E�����[�ƃ��A���[�E���r���\���\�t�����X�v���Ɗ��󐫂̎�,,,,28,,1,19,2020,2020,,,,,,,,,
23944241,�G���_��,no,no,no,,,,"",,"",120007182105,,,,,�c�v�ہ@�_,�V�F���[�� �gMont Blanc�h �ƃw�����E�}���C�A�E�E�B���A���Y,,,,29,,39,57,2021,2021,,,,,,,,,
23944242,�w��\,no,no,no,,,,"",,"",,,,,,�c�v�ہ@�_,�V�F���[�� �gMont Blanc�h �ƃw�����E�}���C�A�E�E�B���A���Y,,�C�M���X�E���}���h�w���47��S�����,,,,,,2021,2021,,,,,,,,,
24515549,�G���_��,no,no,no,,,,"",,"",,,,,,�c�v�ہ@�_,Review Kenneth R. Johnston Unusual Suspects: Pitts Reign of Alarm and the Lost Generation of the 1790s,,,,30,,10,14,2022,2022,,,,,,,,,
24515550,�w��\,no,no,no,,,,"",,"",,,,,,Hiroshi Takubo,Helen Maria Williams and the Romantic Concept of the Imagination,,2022 BRITISH WOMEN WRITERS CONFERENCE,,,,,,2022,2022,,,,,,,,,
