��������ID,�������ʎ��,���ǂ̗L��,���ҍu�����ǂ���,�O�����ǂ���,DOI,PubMedID,PubMedCID,ISSN,J-GLOBAL ID,ISBN,NAID:CiNii Books or Articles��ID,�Y�ƍ��Y�� �������,�Y�ƍ��Y�� �o��ԍ�,�Y�ƍ��Y�� ���J�ԍ�,URL,���Җ��E���\�Җ�,�^�C�g��,�^�C�g���i�p��j,�w�,�o�Ŏ�,��,��,�J�n�y�[�W,�I���y�[�W,�N,�N����,�Y�ƍ��Y�� ������,�Y�ƍ��Y�� ������/�o��l,�Y�ƍ��Y�� �o��N,�Y�ƍ��Y�� �o��N����,�Y�ƍ��Y�� �擾�N,�Y�ƍ��Y�� �擾�N����,�Y�ƍ��Y�� ���J�N,�Y�ƍ��Y�� ���J�N����,�����e�L�X�g
12182568,�w��\,no,no,no,,,,"",,"",,,,,,�Γc��L,����f�[�^�̓��v���,,"���{��w��2011�N�x�t�G���\�e�W,54-57��",,,,,,2011,2011/5/28,,,,,,,,,
12182569,�w��\,no,no,no,,,,"",,"",,,,,,�Γc��L,RMeCab��RCaBoCha�ɂ��e�L�X�g�}�C�j���O,,"���v�A���w��A�����u���񍐏W,292-293��",,,,,,2010,2010/9/8,,,,,,,,,
12182570,�}��,no,no,no,,,,"",,"",,,,,,�Γc��L,R�ɂ��e�L�X�g�}�C�j���O����,,,�X�k�o��,,,,,2008,2008,,,,,,,,,
12182575,�G���_��,yes,no,no,,,,"",,"",,,,,,�Γc ��L,Text Mining in R : Rober Parker's Comments on Bordeaux Red Wine,,,,,,664,670,2008,2008,,,,,,,,,
12182576,�}��,no,no,no,,,,"",,"",,,,,,�Γc ��L,R �ɂ��e�L�X�g�}�C�j���O����,,,�X�k�o��,,,,,2008,2008,,,,,,,,,
12182578,�w��\,no,no,no,,,,"",,"",,,,,,�Γc��L,R�ɂ��e�L�X�g�}�C�j���O����,,���v���������� ���J�u��2009,,,,,,2009,2009/11/24,,,,,,,,,
12182579,�w��\,no,no,no,,,,"",,"",,,,,,�Γc��L,�e�L�X�g�}�C�j���O�c�[��RMeCab��RCaBoCha�ɂ���,,���v�֘A�w��A�����,,,,,,2010,2010/9/8,,,,,,,,,
23042116,�}��,no,no,no,,,,"",,9784627885110,,,,,,�Γc ��L,���H R�ɂ��e�L�X�g�}�C�j���O,,,�X�k�o��,,,,,2020,2020,,,,,,,,,
